{"text_format":"2","workbook":"xlsx","n_sheets":4,"sheets":["Общий","ОИ","ОДан","ОДи"],"not_rendered":{"charts":0,"images":0,"macros":0,"external_links":0,"defined_names":4,"comments":0,"pivot_tables":0},"unopened":[],"bounds":{"document_bytes":16777216,"sheet_cells":100000,"run_cost":"one","rows_first":2000,"rows_last":500,"rows_between":2000,"halvings":0,"cell_chars":16384,"cell_head_chars":4096},"cells_cut":0,"cells_raw":0,"read":"whole","date_system":"1900"}

{"sheet":"Общий","index":0,"n_rows":71,"n_cols":7,"rows_kept":71,"cut":false,"hidden":false,"merged":[]}
["Ведомство","Статус","ОИ","ОДан","ОДи","Рейтинг","Уровень"]
["Главное управление специальных программ Президента Российской Федерации (ГУСП)","През","B","C","C","BCC","Низкий"]
["Государственная фельдъегерская служба Российской Федерации (ГФС России)","През","B","A","C","BAC","Средний"]
["Казначейство России","Прав","A","A","B","AAB","Высокий"]
["МВД России","През","B","A","B","BAB","Средний"]
["МИД России","През","B","B","B","BBB","Средний"]
["Минвостокразвития России","Прав","B","A","B","BAB","Средний"]
["Минздрав России","Прав","A","A","B","AAB","Высокий"]
["Минкультуры России","Прав","B","A","B","BAB","Средний"]
["Минобороны России","През","C","C","B","CCB","Низкий"]
["Минобрнауки России","Прав","B","A","B","BAB","Средний"]
["Минприроды России","Прав","B","A","B","BAB","Средний"]
["Минпромторг России","Прав","B","A","B","BAB","Средний"]
["Минпросвещения России","Прав","A","A","B","AAB","Высокий"]
["Минсельхоз России","Прав","A","A","B","AAB","Высокий"]
["Минспорт России","Прав","A","B","B","ABB","Средний"]
["Минстрой России","Прав","B","A","A","BAA","Высокий"]
["Минтранс России","Прав","B","A","B","BAB","Средний"]
["Минтруд России","Прав","B","A","B","BAB","Средний"]
["Минфин России","Прав","A","A","B","AAB","Высокий"]
["Минцифры России","Прав","A","A","B","AAB","Высокий"]
["Минэкономразвития России","Прав","B","A","B","BAB","Средний"]
["Минэнерго России","Прав","B","A","B","BAB","Средний"]
["Минюст России","През","A","A","C","AAC","Высокий"]
["МЧС России","През","A","B","B","ABB","Средний"]
["Росавиация","Прав","B","A","C","BAC","Средний"]
["Росавтодор","Прав","A","A","A","AAA","Высокий"]
["Росаккредитация","Прав","B","A","B","BAB","Средний"]
["Росалкогольрегулирование","Прав","A","A","B","AAB","Высокий"]
["Росархив","През","A","A","B","AAB","Высокий"]
["Росводресурсы","Прав","B","A","B","BAB","Средний"]
["Росгвардия","През","B","A","B","BAB","Средний"]
["Росгидромет","Прав","A","A","B","AAB","Высокий"]
["Росжелдор","Прав","B","A","C","BAC","Средний"]
["Росздравнадзор","Прав","B","A","C","BAC","Средний"]
["Росимущество","Прав","B","A","B","BAB","Средний"]
["Роскомнадзор","Прав","B","A","C","BAC","Средний"]
["Рослесхоз","Прав","B","A","B","BAB","Средний"]
["Росмолодёжь","Прав","A","A","B","AAB","Высокий"]
["Росморречфлот","Прав","C","A","C","CAC","Низкий"]
["Роснедра","Прав","B","B","B","BBB","Средний"]
["Рособрнадзор","Прав","A","B","B","ABB","Средний"]
["Роспатент","Прав","C","A","B","CAB","Средний"]
["Роспотребнадзор","Прав","B","A","B","BAB","Средний"]
["Росприроднадзор","Прав","B","A","B","BAB","Средний"]
["Росреестр","Прав","A","A","A","AAA","Высокий"]
["Росрезерв","Прав","A","A","C","AAC","Высокий"]
["Росрыболовство","Прав","B","A","B","BAB","Средний"]
["Россельхознадзор","Прав","A","A","B","AAB","Высокий"]
["Россотрудничество","През","B","C","C","BCC","Низкий"]
["Росстандарт","Прав","B","A","B","BAB","Средний"]
["Росстат","Прав","A","A","A","AAA","Высокий"]
["Ростехнадзор","Прав","A","A","B","AAB","Высокий"]
["Ространснадзор","Прав","B","A","C","BAC","Средний"]
["Роструд","Прав","B","A","A","BAA","Высокий"]
["Ростуризм","Прав","C","A","B","CAB","Средний"]
["Росфинмониторинг","През","B","B","B","BBB","Средний"]
["СВР России","През","C","C","N/A","CC","Низкий"]
["Управление делами Президента Российской Федерации","През","C","B","C","CBC","Низкий"]
["ФАДН России","Прав","B","A","C","BAC","Средний"]
["ФАС России","Прав","A","A","B","AAB","Высокий"]
["Федеральная пробирная палата","Прав","B","C","C","BCC","Низкий"]
["ФМБА России","Прав","B","A","B","BAB","Средний"]
["ФНС России","Прав","B","A","B","BAB","Средний"]
["ФСБ России","През","B","C","N/A","BC","Низкий"]
["ФСВТС России","През","B","A","C","BAC","Средний"]
["ФСИН России","През","C","B","B","CBB","Средний"]
["ФСО России","През","B","C","N/A","BC","Низкий"]
["ФССП России","През","B","A","B","BAB","Средний"]
["ФСТЭК России","През","B","A","C","BAC","Средний"]
["ФТС России","Прав","A","A","B","AAB","Высокий"]

{"sheet":"ОИ","index":1,"n_rows":71,"n_cols":7,"rows_kept":71,"cut":false,"hidden":false,"merged":[]}
["Ведомство","Статус","Сайты","Запросы","Журналисты","Average","Индекс"]
["Главное управление специальных программ Президента Российской Федерации (ГУСП)","През",0.54761904761904767,0.625,0.5,{"$f":"AVERAGE(C2:E2)","v":0.55753968253968256},{"$f":"IF(F2>=0.7,\"A\",IF(F2>=0.4,\"B\",\"C\"))","v":"B"}]
["Государственная фельдъегерская служба Российской Федерации (ГФС России)","През",0.79545454545454541,0.875,0,0.55681818181818177,"B"]
["Казначейство России","Прав",0.90909090909090906,0.875,0.45,0.74469696969696975,"A"]
["МВД России","През",0.91666666666666663,0.375,0.35,0.54722222222222217,"B"]
["МИД России","През",0.86956521739130432,0.625,0.2,0.56485507246376809,"B"]
["Минвостокразвития России","Прав",0.95454545454545459,0.75,0.1,0.60151515151515156,"B"]
["Минздрав России","Прав",0.90909090909090906,0.875,0.55000000000000004,0.77803030303030296,"A"]
["Минкультуры России","Прав",0.86956521739130432,0.625,0.6,0.6981884057971014,"B"]
["Минобороны России","През",0.95833333333333337,0,0.15,0.36944444444444446,"C"]
["Минобрнауки России","Прав",0.81818181818181823,0.625,0.1,0.51439393939393951,"B"]
["Минприроды России","Прав",0.82608695652173914,0.875,0.1,0.60036231884057978,"B"]
["Минпромторг России","Прав",0.77272727272727271,0.625,0.15,0.51590909090909087,"B"]
["Минпросвещения России","Прав",0.95833333333333337,0.875,0.35,0.72777777777777786,"A"]
["Минсельхоз России","Прав",1,0.875,0.35,0.7416666666666667,"A"]
["Минспорт России","Прав",0.95652173913043481,0.625,0.7,0.76050724637681155,"A"]
["Минстрой России","Прав",0.81818181818181823,0.75,0.35,0.63939393939393951,"B"]
["Минтранс России","Прав",0.95652173913043481,0.875,0.1,0.64384057971014497,"B"]
["Минтруд России","Прав",0.82608695652173914,0.875,0.2,0.6336956521739131,"B"]
["Минфин России","Прав",0.90909090909090906,0.75,0.45,0.70303030303030312,"A"]
["Минцифры России","Прав",1,0.75,0.6,0.78333333333333333,"A"]
["Минэкономразвития России","Прав",0.93478260869565222,0.75,0.4,0.69492753623188408,"B"]
["Минэнерго России","Прав",0.86956521739130432,0.75,0.45,0.68985507246376809,"B"]
["Минюст России","През",0.86956521739130432,0.75,0.65,0.75652173913043474,"A"]
["МЧС России","През",0.83333333333333337,0.875,0.6,0.76944444444444449,"A"]
["Росавиация","Прав",0.875,0.625,0.3,0.6,"B"]
["Росавтодор","Прав",0.95454545454545459,0.75,0.5,0.73484848484848486,"A"]
["Росаккредитация","Прав",0.77083333333333337,0.5,0.7,0.65694444444444444,"B"]
["Росалкогольрегулирование","Прав",0.8125,1,0.7,0.83750000000000002,"A"]
["Росархив","През",1,0.875,0.5,0.79166666666666663,"A"]
["Росводресурсы","Прав",0.95652173913043481,0.625,0.45,0.67717391304347829,"B"]
["Росгвардия","През",0.84782608695652173,0.625,0.35,0.6076086956521739,"B"]
["Росгидромет","Прав",1,0.625,0.6,0.7416666666666667,"A"]
["Росжелдор","Прав",0.95652173913043481,0,0.3,{"$f":"AVERAGE(C34:E34)","v":0.41884057971014493},{"$f":"IF(F34>=0.7,\"A\",IF(F34>=0.4,\"B\",\"C\"))","v":"B"}]
["Росздравнадзор","Прав",0.89583333333333337,0.75,0.2,0.61527777777777781,"B"]
["Росимущество","Прав",0.91304347826086951,0.75,0.4,0.68768115942028984,"B"]
["Роскомнадзор","Прав",0.95833333333333337,0.75,0.35,0.68611111111111123,"B"]
["Рослесхоз","Прав",0.83333333333333337,0.75,0.3,0.62777777777777788,"B"]
["Росмолодёжь","Прав",0.86363636363636365,0.75,0.7,0.77121212121212113,"A"]
["Росморречфлот","Прав",1,0,0.15,0.3833333333333333,"C"]
["Роснедра","Прав",0.89130434782608692,0.875,0.1,0.62210144927536237,"B"]
["Рособрнадзор","Прав",0.91304347826086951,0.875,0.4,0.72934782608695647,"A"]
["Роспатент","Прав",0.95652173913043481,0,0.15,0.36884057971014489,"C"]
["Роспотребнадзор","Прав",0.9375,0.875,0.1,0.63750000000000007,"B"]
["Росприроднадзор","Прав",0.91666666666666663,0.75,0.1,0.58888888888888891,"B"]
["Росреестр","Прав",0.95833333333333337,0.75,0.55000000000000004,0.75277777777777788,"A"]
["Росрезерв","Прав",0.90909090909090906,0.875,0.4,0.72803030303030303,"A"]
["Росрыболовство","Прав",0.85416666666666663,0.875,0.25,0.65972222222222221,"B"]
["Россельхознадзор","Прав",0.8125,0.875,0.7,0.79583333333333339,"A"]
["Россотрудничество","През",0.86363636363636365,0.75,0.3,0.63787878787878793,"B"]
["Росстандарт","Прав",0.95833333333333337,0.375,0.2,0.51111111111111118,"B"]
["Росстат","Прав",1,0.875,0.75,0.875,"A"]
["Ростехнадзор","Прав",0.91666666666666663,0.75,0.45,0.7055555555555556,"A"]
["Ространснадзор","Прав",0.95833333333333337,0.625,0.5,0.69444444444444453,"B"]
["Роструд","Прав",0.91666666666666663,0.625,0.5,0.68055555555555547,"B"]
["Ростуризм","Прав",0.95454545454545459,0,0.1,0.35151515151515156,"C"]
["Росфинмониторинг","През",0.71739130434782605,0.75,0.45,0.63913043478260867,"B"]
["СВР России","През",0.68181818181818177,0,0.25,0.31060606060606061,"C"]
["Управление делами Президента Российской Федерации","През",0.90476190476190477,0,0.15,0.35158730158730161,"C"]
["ФАДН России","Прав",0.84090909090909094,0.75,0.15,0.58030303030303021,"B"]
["ФАС России","Прав",0.91666666666666663,0.875,0.75,0.84722222222222221,"A"]
["Федеральная пробирная палата","Прав",0.63636363636363635,0.875,0.45,0.6537878787878787,"B"]
["ФМБА России","Прав",0.91666666666666663,0.625,0.3,0.61388888888888882,"B"]
["ФНС России","Прав",0.91666666666666663,0.75,0.3,0.65555555555555556,"B"]
["ФСБ России","През",0.76086956521739135,0.5,0.3,0.52028985507246384,"B"]
["ФСВТС России","През",0.80952380952380953,0.625,0.1,{"$f":"AVERAGE(C66:E66)","v":0.51150793650793658},{"$f":"IF(F66>=0.7,\"A\",IF(F66>=0.4,\"B\",\"C\"))","v":"B"}]
["ФСИН России","През",0.78260869565217395,0,0.1,0.29420289855072462,"C"]
["ФСО России","През",0.65217391304347827,0.375,0.65,0.55905797101449284,"B"]
["ФССП России","През",0.95833333333333337,0.75,0.2,0.63611111111111118,"B"]
["ФСТЭК России","През",0.71739130434782605,0.75,0.3,0.58913043478260874,"B"]
["ФТС России","Прав",1,0.75,0.75,0.83333333333333337,"A"]

{"sheet":"ОДан","index":2,"n_rows":71,"n_cols":4,"rows_kept":71,"cut":false,"hidden":false,"merged":[]}
["Ведомство","Статус","ОД","Индекс"]
["Главное управление специальных программ Президента Российской Федерации (ГУСП)","През",0,{"$f":"IF(C2>=0.7,\"A\",IF(C2>=0.4,\"B\",\"C\"))","v":"C"}]
["Государственная фельдъегерская служба Российской Федерации (ГФС России)","През",0.82467532467532467,"A"]
["Казначейство России","Прав",0.91558441558441561,"A"]
["МВД России","През",0.88961038961038963,"A"]
["МИД России","През",0.69480519480519476,"B"]
["Минвостокразвития России","Прав",0.87662337662337664,"A"]
["Минздрав России","Прав",0.74675324675324672,"A"]
["Минкультуры России","Прав",0.86363636363636365,"A"]
["Минобороны России","През",6.4935064935064939E-3,"C"]
["Минобрнауки России","Прав",0.86363636363636365,"A"]
["Минприроды России","Прав",0.89610389610389607,"A"]
["Минпромторг России","Прав",0.79220779220779225,"A"]
["Минпросвещения России","Прав",0.88311688311688308,"A"]
["Минсельхоз России","Прав",0.82467532467532467,"A"]
["Минспорт России","Прав",0.61688311688311692,"B"]
["Минстрой России","Прав",0.90259740259740262,"A"]
["Минтранс России","Прав",0.74675324675324672,"A"]
["Минтруд России","Прав",0.87012987012987009,"A"]
["Минфин России","Прав",0.8441558441558441,"A"]
["Минцифры России","Прав",0.81818181818181823,"A"]
["Минэкономразвития России","Прав",0.79220779220779225,"A"]
["Минэнерго России","Прав",0.90259740259740262,"A"]
["Минюст России","През",0.77922077922077926,"A"]
["МЧС России","През",0.6558441558441559,"B"]
["Росавиация","Прав",0.87662337662337664,"A"]
["Росавтодор","Прав",0.83766233766233766,"A"]
["Росаккредитация","Прав",0.70779220779220775,"A"]
["Росалкогольрегулирование","Прав",0.85064935064935066,"A"]
["Росархив","През",0.74025974025974028,"A"]
["Росводресурсы","Прав",0.7857142857142857,"A"]
["Росгвардия","През",0.72077922077922074,"A"]
["Росгидромет","Прав",0.70779220779220775,"A"]
["Росжелдор","Прав",0.87012987012987009,{"$f":"IF(C34>=0.7,\"A\",IF(C34>=0.4,\"B\",\"C\"))","v":"A"}]
["Росздравнадзор","Прав",0.89610389610389607,"A"]
["Росимущество","Прав",0.9285714285714286,"A"]
["Роскомнадзор","Прав",0.70779220779220775,"A"]
["Рослесхоз","Прав",0.81818181818181823,"A"]
["Росмолодёжь","Прав",0.81168831168831168,"A"]
["Росморречфлот","Прав",0.70129870129870131,"A"]
["Роснедра","Прав",0.66233766233766234,"B"]
["Рособрнадзор","Прав",0.68181818181818177,"B"]
["Роспатент","Прав",0.83116883116883122,"A"]
["Роспотребнадзор","Прав",0.87012987012987009,"A"]
["Росприроднадзор","Прав",0.81168831168831168,"A"]
["Росреестр","Прав",0.79870129870129869,"A"]
["Росрезерв","Прав",0.77272727272727271,"A"]
["Росрыболовство","Прав",0.74025974025974028,"A"]
["Россельхознадзор","Прав",0.81168831168831168,"A"]
["Россотрудничество","През",0.14285714285714285,"C"]
["Росстандарт","Прав",0.81818181818181823,"A"]
["Росстат","Прав",0.82467532467532467,"A"]
["Ростехнадзор","Прав",0.75324675324675328,"A"]
["Ространснадзор","Прав",0.74675324675324672,"A"]
["Роструд","Прав",0.87662337662337664,"A"]
["Ростуризм","Прав",0.81818181818181823,"A"]
["Росфинмониторинг","През",0.50649350649350644,"B"]
["СВР России","През",0,"C"]
["Управление делами Президента Российской Федерации","През",0.61038961038961037,"B"]
["ФАДН России","Прав",0.85064935064935066,"A"]
["ФАС России","Прав",0.79220779220779225,"A"]
["Федеральная пробирная палата","Прав",0,"C"]
["ФМБА России","Прав",0.76623376623376627,"A"]
["ФНС России","Прав",0.88961038961038963,"A"]
["ФСБ России","През",0,"C"]
["ФСВТС России","През",0.7857142857142857,{"$f":"IF(C66>=0.7,\"A\",IF(C66>=0.4,\"B\",\"C\"))","v":"A"}]
["ФСИН России","През",0.64935064935064934,"B"]
["ФСО России","През",0,"C"]
["ФССП России","През",0.90259740259740262,"A"]
["ФСТЭК России","През",0.80519480519480524,"A"]
["ФТС России","Прав",0.83766233766233766,"A"]

{"sheet":"ОДи","index":3,"n_rows":71,"n_cols":7,"rows_kept":71,"cut":false,"hidden":false,"merged":[]}
["Ведомство","Статус","Соцсети","Общ.советы","Average","Индекс"]
["Главное управление специальных программ Президента Российской Федерации (ГУСП)","През",0,null,{"$f":"AVERAGE(C2:D2)","v":0},{"$f":"IF(E2>=0.7,\"A\",IF(E2>=0.4,\"B\",\"C\"))","v":"C"}]
["Государственная фельдъегерская служба Российской Федерации (ГФС России)","През",0,null,0,"C"]
["Казначейство России","Прав",0.47399999999999998,0.54545454545454541,0.5097272727272727,"B"]
["МВД России","През",0.70199999999999996,0.45454545454545453,0.57827272727272727,"B"]
["МИД России","През",0.52600000000000002,null,0.52600000000000002,"B"]
["Минвостокразвития России","Прав",0.42099999999999999,0.41818181818181815,0.41959090909090907,"B"]
["Минздрав России","Прав",0.78900000000000003,0.49090909090909091,0.63995454545454544,"B"]
["Минкультуры России","Прав",0.54400000000000004,0.52727272727272723,0.53563636363636369,"B"]
["Минобороны России","През",0.82499999999999996,0.36363636363636365,0.59431818181818175,"B"]
["Минобрнауки России","Прав",0.68400000000000005,0.43636363636363634,0.56018181818181823,"B"]
["Минприроды России","Прав",0.73699999999999999,0.61818181818181817,0.67759090909090913,"B"]
["Минпромторг России","Прав",0.47399999999999998,0.32727272727272727,0.40063636363636362,"B"]
["Минпросвещения России","Прав",0.77200000000000002,0.58181818181818179,0.6769090909090909,"B"]
["Минсельхоз России","Прав",0.68400000000000005,0.54545454545454541,0.61472727272727279,"B"]
["Минспорт России","Прав",0.61399999999999999,0.61818181818181817,0.61609090909090902,"B"]
["Минстрой России","Прав",0.63200000000000001,0.81818181818181823,0.72509090909090912,"A"]
["Минтранс России","Прав",0.64900000000000002,0.45454545454545453,0.5517727272727273,"B"]
["Минтруд России","Прав",0.73699999999999999,0.6,0.66849999999999998,"B"]
["Минфин России","Прав",0.61399999999999999,0.41818181818181815,0.51609090909090904,"B"]
["Минцифры России","Прав",0.66700000000000004,0.43636363636363634,0.55168181818181816,"B"]
["Минэкономразвития России","Прав",0.71899999999999997,0.47272727272727272,0.59586363636363637,"B"]
["Минэнерго России","Прав",0.89500000000000002,0.47272727272727272,0.68386363636363634,"B"]
["Минюст России","През",0,0.18181818181818182,9.0909090909090912E-2,"C"]
["МЧС России","През",0.73699999999999999,0.4,0.56850000000000001,"B"]
["Росавиация","Прав",0.21099999999999999,0.54545454545454541,0.37822727272727269,"C"]
["Росавтодор","Прав",1,0.47272727272727272,0.73636363636363633,"A"]
["Росаккредитация","Прав",0.57899999999999996,0.50909090909090904,0.5440454545454545,"B"]
["Росалкогольрегулирование","Прав",0.52600000000000002,0.47272727272727272,0.49936363636363634,"B"]
["Росархив","През",0.63200000000000001,0.52727272727272723,0.57963636363636362,"B"]
["Росводресурсы","Прав",0.73699999999999999,0.49090909090909091,0.61395454545454542,"B"]
["Росгвардия","През",0.57899999999999996,null,0.57899999999999996,"B"]
["Росгидромет","Прав",0.78900000000000003,0.6,0.69450000000000001,"B"]
["Росжелдор","Прав",0,0.32727272727272727,{"$f":"AVERAGE(C34:D34)","v":0.16363636363636364},{"$f":"IF(E34>=0.7,\"A\",IF(E34>=0.4,\"B\",\"C\"))","v":"C"}]
["Росздравнадзор","Прав",0.439,0.25454545454545452,0.34677272727272723,"C"]
["Росимущество","Прав",0.57899999999999996,0.4,0.48949999999999999,"B"]
["Роскомнадзор","Прав",0.47399999999999998,0.27272727272727271,0.37336363636363634,"C"]
["Рослесхоз","Прав",0.52600000000000002,0.49090909090909091,0.50845454545454549,"B"]
["Росмолодёжь","Прав",0.63200000000000001,0.36363636363636365,0.49781818181818183,"B"]
["Росморречфлот","Прав",0.42099999999999999,0.34545454545454546,0.38322727272727275,"C"]
["Роснедра","Прав",0.68400000000000005,0.45454545454545453,0.56927272727272726,"B"]
["Рособрнадзор","Прав",0.63200000000000001,0.32727272727272727,0.47963636363636364,"B"]
["Роспатент","Прав",0.73699999999999999,0.58181818181818179,0.65940909090909083,"B"]
["Роспотребнадзор","Прав",0.73699999999999999,0.52727272727272723,0.63213636363636361,"B"]
["Росприроднадзор","Прав",0.73699999999999999,0.34545454545454546,0.54122727272727267,"B"]
["Росреестр","Прав",0.78900000000000003,0.61818181818181817,0.70359090909090916,"A"]
["Росрезерв","Прав",0,null,0,"C"]
["Росрыболовство","Прав",0.49099999999999999,0.67272727272727273,0.58186363636363636,"B"]
["Россельхознадзор","Прав",0.63200000000000001,0.65454545454545454,0.64327272727272722,"B"]
["Россотрудничество","През",0.73699999999999999,0,0.36849999999999999,"C"]
["Росстандарт","Прав",0.47399999999999998,0.47272727272727272,0.47336363636363632,"B"]
["Росстат","Прав",0.78900000000000003,0.81818181818181823,0.80359090909090913,"A"]
["Ростехнадзор","Прав",0.64900000000000002,0.52727272727272723,0.58813636363636368,"B"]
["Ространснадзор","Прав",0.33300000000000002,0.41818181818181815,0.37559090909090909,"C"]
["Роструд","Прав",0.877,0.5636363636363636,0.72031818181818186,"A"]
["Ростуризм","Прав",0.64900000000000002,0.4,0.52449999999999997,"B"]
["Росфинмониторинг","През",0.52600000000000002,null,0.52600000000000002,"B"]
["СВР России","През",0,null,0,"N/A","рейтинг не присваивается"]
["Управление делами Президента Российской Федерации","През",0,0.21818181818181817,0.10909090909090909,{"$f":"IF(E59>=0.7,\"A\",IF(E59>=0.4,\"B\",\"C\"))","v":"C"}]
["ФАДН России","Прав",0.54400000000000004,0.21818181818181817,0.38109090909090909,"C"]
["ФАС России","Прав",0.89500000000000002,0.49090909090909091,0.69295454545454549,"B"]
["Федеральная пробирная палата","Прав",0,1.8181818181818181E-2,9.0909090909090905E-3,"C"]
["ФМБА России","През",0.50900000000000001,0.32727272727272727,0.41813636363636364,"B"]
["ФНС России","Прав",0.47399999999999998,0.58181818181818179,0.52790909090909088,"B"]
["ФСБ России","Прав",0,0.25454545454545452,0.12727272727272726,"N/A","рейтинг не присваивается"]
["ФСВТС России","През",0,null,{"$f":"AVERAGE(C66:D66)","v":0},{"$f":"IF(E66>=0.7,\"A\",IF(E66>=0.4,\"B\",\"C\"))","v":"C"}]
["ФСИН России","През",0.57899999999999996,0.38181818181818183,0.4804090909090909,{"$f":"IF(E67>=0.7,\"A\",IF(E67>=0.4,\"B\",\"C\"))","v":"B"}]
["ФСО России","През",0,null,0,"N/A","рейтинг не присваивается"]
["ФССП России","През",0.50900000000000001,0.49090909090909091,0.49995454545454543,{"$f":"IF(E69>=0.7,\"A\",IF(E69>=0.4,\"B\",\"C\"))","v":"B"}]
["ФСТЭК России","През",0,null,0,{"$f":"IF(E70>=0.7,\"A\",IF(E70>=0.4,\"B\",\"C\"))","v":"C"}]
["ФТС России","Прав",0.78900000000000003,0.36363636363636365,0.57631818181818184,{"$f":"IF(E71>=0.7,\"A\",IF(E71>=0.4,\"B\",\"C\"))","v":"B"}]