{"text_format":"2","workbook":"xlsx","n_sheets":4,"sheets":["Рейтинг_ОДи","Коды","Соцсети","Обществ_советы"],"not_rendered":{"charts":0,"images":0,"macros":0,"external_links":0,"defined_names":1,"comments":0,"pivot_tables":0},"unopened":[],"bounds":{"document_bytes":16777216,"sheet_cells":100000,"run_cost":"one","rows_first":2000,"rows_last":500,"rows_between":2000,"halvings":0,"cell_chars":16384,"cell_head_chars":4096},"cells_cut":0,"cells_raw":0,"read":"whole","date_system":"1900"}

{"sheet":"Рейтинг_ОДи","index":0,"n_rows":71,"n_cols":7,"rows_kept":71,"cut":false,"hidden":false,"merged":[]}
["Ведомство","Статус","Соцсети","Общ.советы","Average","Индекс"]
["Главное управление специальных программ Президента Российской Федерации (ГУСП)","През",0,"-",{"$f":"AVERAGE(C2:D2)","v":0},{"$f":"IF(E2>=0.7,\"A\",IF(E2>=0.4,\"B\",\"C\"))","v":"C"}]
["Государственная фельдъегерская служба Российской Федерации (ГФС России)","През",0,"-",{"$f":"AVERAGE(C3:D3)","v":0},{"$f":"IF(E3>=0.7,\"A\",IF(E3>=0.4,\"B\",\"C\"))","v":"C"}]
["Казначейство России","Прав",0.47399999999999998,0.54545454545454541,{"$f":"AVERAGE(C4:D4)","v":0.5097272727272727},{"$f":"IF(E4>=0.7,\"A\",IF(E4>=0.4,\"B\",\"C\"))","v":"B"}]
["МВД России","През",0.70199999999999996,0.45454545454545453,{"$f":"AVERAGE(C5:D5)","v":0.57827272727272727},{"$f":"IF(E5>=0.7,\"A\",IF(E5>=0.4,\"B\",\"C\"))","v":"B"}]
["МИД России","През",0.52600000000000002,"-",{"$f":"AVERAGE(C6:D6)","v":0.52600000000000002},{"$f":"IF(E6>=0.7,\"A\",IF(E6>=0.4,\"B\",\"C\"))","v":"B"}]
["Минвостокразвития России","Прав",0.42099999999999999,0.41818181818181815,{"$f":"AVERAGE(C7:D7)","v":0.41959090909090907},{"$f":"IF(E7>=0.7,\"A\",IF(E7>=0.4,\"B\",\"C\"))","v":"B"}]
["Минздрав России","Прав",0.78900000000000003,0.49090909090909091,{"$f":"AVERAGE(C8:D8)","v":0.63995454545454544},{"$f":"IF(E8>=0.7,\"A\",IF(E8>=0.4,\"B\",\"C\"))","v":"B"}]
["Минкультуры России","Прав",0.54400000000000004,0.52727272727272723,{"$f":"AVERAGE(C9:D9)","v":0.53563636363636369},{"$f":"IF(E9>=0.7,\"A\",IF(E9>=0.4,\"B\",\"C\"))","v":"B"}]
["Минобороны России","През",0.82499999999999996,0.36363636363636365,{"$f":"AVERAGE(C10:D10)","v":0.59431818181818175},{"$f":"IF(E10>=0.7,\"A\",IF(E10>=0.4,\"B\",\"C\"))","v":"B"}]
["Минобрнауки России","Прав",0.68400000000000005,0.43636363636363634,{"$f":"AVERAGE(C11:D11)","v":0.56018181818181823},{"$f":"IF(E11>=0.7,\"A\",IF(E11>=0.4,\"B\",\"C\"))","v":"B"}]
["Минприроды России","Прав",0.73699999999999999,0.61818181818181817,{"$f":"AVERAGE(C12:D12)","v":0.67759090909090913},{"$f":"IF(E12>=0.7,\"A\",IF(E12>=0.4,\"B\",\"C\"))","v":"B"}]
["Минпромторг России","Прав",0.47399999999999998,0.32727272727272727,{"$f":"AVERAGE(C13:D13)","v":0.40063636363636362},{"$f":"IF(E13>=0.7,\"A\",IF(E13>=0.4,\"B\",\"C\"))","v":"B"}]
["Минпросвещения России","Прав",0.77200000000000002,0.58181818181818179,{"$f":"AVERAGE(C14:D14)","v":0.6769090909090909},{"$f":"IF(E14>=0.7,\"A\",IF(E14>=0.4,\"B\",\"C\"))","v":"B"}]
["Минсельхоз России","Прав",0.68400000000000005,0.54545454545454541,{"$f":"AVERAGE(C15:D15)","v":0.61472727272727279},{"$f":"IF(E15>=0.7,\"A\",IF(E15>=0.4,\"B\",\"C\"))","v":"B"}]
["Минспорт России","Прав",0.61399999999999999,0.61818181818181817,{"$f":"AVERAGE(C16:D16)","v":0.61609090909090902},{"$f":"IF(E16>=0.7,\"A\",IF(E16>=0.4,\"B\",\"C\"))","v":"B"}]
["Минстрой России","Прав",0.63200000000000001,0.81818181818181823,{"$f":"AVERAGE(C17:D17)","v":0.72509090909090912},{"$f":"IF(E17>=0.7,\"A\",IF(E17>=0.4,\"B\",\"C\"))","v":"A"}]
["Минтранс России","Прав",0.64900000000000002,0.45454545454545453,{"$f":"AVERAGE(C18:D18)","v":0.5517727272727273},{"$f":"IF(E18>=0.7,\"A\",IF(E18>=0.4,\"B\",\"C\"))","v":"B"}]
["Минтруд России","Прав",0.73699999999999999,0.6,{"$f":"AVERAGE(C19:D19)","v":0.66849999999999998},{"$f":"IF(E19>=0.7,\"A\",IF(E19>=0.4,\"B\",\"C\"))","v":"B"}]
["Минфин России","Прав",0.61399999999999999,0.41818181818181815,{"$f":"AVERAGE(C20:D20)","v":0.51609090909090904},{"$f":"IF(E20>=0.7,\"A\",IF(E20>=0.4,\"B\",\"C\"))","v":"B"}]
["Минцифры России","Прав",0.66700000000000004,0.43636363636363634,{"$f":"AVERAGE(C21:D21)","v":0.55168181818181816},{"$f":"IF(E21>=0.7,\"A\",IF(E21>=0.4,\"B\",\"C\"))","v":"B"}]
["Минэкономразвития России","Прав",0.71899999999999997,0.47272727272727272,{"$f":"AVERAGE(C22:D22)","v":0.59586363636363637},{"$f":"IF(E22>=0.7,\"A\",IF(E22>=0.4,\"B\",\"C\"))","v":"B"}]
["Минэнерго России","Прав",0.89500000000000002,0.47272727272727272,{"$f":"AVERAGE(C23:D23)","v":0.68386363636363634},{"$f":"IF(E23>=0.7,\"A\",IF(E23>=0.4,\"B\",\"C\"))","v":"B"}]
["Минюст России","През",0,0.18181818181818182,{"$f":"AVERAGE(C24:D24)","v":9.0909090909090912E-2},{"$f":"IF(E24>=0.7,\"A\",IF(E24>=0.4,\"B\",\"C\"))","v":"C"}]
["МЧС России","През",0.73699999999999999,0.4,{"$f":"AVERAGE(C25:D25)","v":0.56850000000000001},{"$f":"IF(E25>=0.7,\"A\",IF(E25>=0.4,\"B\",\"C\"))","v":"B"}]
["Росавиация","Прав",0.21099999999999999,0.54545454545454541,{"$f":"AVERAGE(C26:D26)","v":0.37822727272727269},{"$f":"IF(E26>=0.7,\"A\",IF(E26>=0.4,\"B\",\"C\"))","v":"C"}]
["Росавтодор","Прав",1,0.47272727272727272,{"$f":"AVERAGE(C27:D27)","v":0.73636363636363633},{"$f":"IF(E27>=0.7,\"A\",IF(E27>=0.4,\"B\",\"C\"))","v":"A"}]
["Росаккредитация","Прав",0.57899999999999996,0.50909090909090904,{"$f":"AVERAGE(C28:D28)","v":0.5440454545454545},{"$f":"IF(E28>=0.7,\"A\",IF(E28>=0.4,\"B\",\"C\"))","v":"B"}]
["Росалкогольрегулирование","Прав",0.52600000000000002,0.47272727272727272,{"$f":"AVERAGE(C29:D29)","v":0.49936363636363634},{"$f":"IF(E29>=0.7,\"A\",IF(E29>=0.4,\"B\",\"C\"))","v":"B"}]
["Росархив","През",0.63200000000000001,0.52727272727272723,{"$f":"AVERAGE(C30:D30)","v":0.57963636363636362},{"$f":"IF(E30>=0.7,\"A\",IF(E30>=0.4,\"B\",\"C\"))","v":"B"}]
["Росводресурсы","Прав",0.73699999999999999,0.49090909090909091,{"$f":"AVERAGE(C31:D31)","v":0.61395454545454542},{"$f":"IF(E31>=0.7,\"A\",IF(E31>=0.4,\"B\",\"C\"))","v":"B"}]
["Росгвардия","През",0.57899999999999996,"-",{"$f":"AVERAGE(C32:D32)","v":0.57899999999999996},{"$f":"IF(E32>=0.7,\"A\",IF(E32>=0.4,\"B\",\"C\"))","v":"B"}]
["Росгидромет","Прав",0.78900000000000003,0.6,{"$f":"AVERAGE(C33:D33)","v":0.69450000000000001},{"$f":"IF(E33>=0.7,\"A\",IF(E33>=0.4,\"B\",\"C\"))","v":"B"}]
["Росжелдор","Прав",0,0.32727272727272727,{"$f":"AVERAGE(C34:D34)","v":0.16363636363636364},{"$f":"IF(E34>=0.7,\"A\",IF(E34>=0.4,\"B\",\"C\"))","v":"C"}]
["Росздравнадзор","Прав",0.439,0.25454545454545452,{"$f":"AVERAGE(C35:D35)","v":0.34677272727272723},{"$f":"IF(E35>=0.7,\"A\",IF(E35>=0.4,\"B\",\"C\"))","v":"C"}]
["Росимущество","Прав",0.57899999999999996,0.4,{"$f":"AVERAGE(C36:D36)","v":0.48949999999999999},{"$f":"IF(E36>=0.7,\"A\",IF(E36>=0.4,\"B\",\"C\"))","v":"B"}]
["Роскомнадзор","Прав",0.47399999999999998,0.27272727272727271,{"$f":"AVERAGE(C37:D37)","v":0.37336363636363634},{"$f":"IF(E37>=0.7,\"A\",IF(E37>=0.4,\"B\",\"C\"))","v":"C"}]
["Рослесхоз","Прав",0.52600000000000002,0.49090909090909091,{"$f":"AVERAGE(C38:D38)","v":0.50845454545454549},{"$f":"IF(E38>=0.7,\"A\",IF(E38>=0.4,\"B\",\"C\"))","v":"B"}]
["Росмолодёжь","Прав",0.63200000000000001,0.36363636363636365,{"$f":"AVERAGE(C39:D39)","v":0.49781818181818183},{"$f":"IF(E39>=0.7,\"A\",IF(E39>=0.4,\"B\",\"C\"))","v":"B"}]
["Росморречфлот","Прав",0.42099999999999999,0.34545454545454546,{"$f":"AVERAGE(C40:D40)","v":0.38322727272727275},{"$f":"IF(E40>=0.7,\"A\",IF(E40>=0.4,\"B\",\"C\"))","v":"C"}]
["Роснедра","Прав",0.68400000000000005,0.45454545454545453,{"$f":"AVERAGE(C41:D41)","v":0.56927272727272726},{"$f":"IF(E41>=0.7,\"A\",IF(E41>=0.4,\"B\",\"C\"))","v":"B"}]
["Рособрнадзор","Прав",0.63200000000000001,0.32727272727272727,{"$f":"AVERAGE(C42:D42)","v":0.47963636363636364},{"$f":"IF(E42>=0.7,\"A\",IF(E42>=0.4,\"B\",\"C\"))","v":"B"}]
["Роспатент","Прав",0.73699999999999999,0.58181818181818179,{"$f":"AVERAGE(C43:D43)","v":0.65940909090909083},{"$f":"IF(E43>=0.7,\"A\",IF(E43>=0.4,\"B\",\"C\"))","v":"B"}]
["Роспотребнадзор","Прав",0.73699999999999999,0.52727272727272723,{"$f":"AVERAGE(C44:D44)","v":0.63213636363636361},{"$f":"IF(E44>=0.7,\"A\",IF(E44>=0.4,\"B\",\"C\"))","v":"B"}]
["Росприроднадзор","Прав",0.73699999999999999,0.34545454545454546,{"$f":"AVERAGE(C45:D45)","v":0.54122727272727267},{"$f":"IF(E45>=0.7,\"A\",IF(E45>=0.4,\"B\",\"C\"))","v":"B"}]
["Росреестр","Прав",0.78900000000000003,0.61818181818181817,{"$f":"AVERAGE(C46:D46)","v":0.70359090909090916},{"$f":"IF(E46>=0.7,\"A\",IF(E46>=0.4,\"B\",\"C\"))","v":"A"}]
["Росрезерв","Прав",0,"-",{"$f":"AVERAGE(C47:D47)","v":0},{"$f":"IF(E47>=0.7,\"A\",IF(E47>=0.4,\"B\",\"C\"))","v":"C"}]
["Росрыболовство","Прав",0.49099999999999999,0.67272727272727273,{"$f":"AVERAGE(C48:D48)","v":0.58186363636363636},{"$f":"IF(E48>=0.7,\"A\",IF(E48>=0.4,\"B\",\"C\"))","v":"B"}]
["Россельхознадзор","Прав",0.63200000000000001,0.65454545454545454,{"$f":"AVERAGE(C49:D49)","v":0.64327272727272722},{"$f":"IF(E49>=0.7,\"A\",IF(E49>=0.4,\"B\",\"C\"))","v":"B"}]
["Россотрудничество","През",0.73699999999999999,0,{"$f":"AVERAGE(C50:D50)","v":0.36849999999999999},{"$f":"IF(E50>=0.7,\"A\",IF(E50>=0.4,\"B\",\"C\"))","v":"C"}]
["Росстандарт","Прав",0.47399999999999998,0.47272727272727272,{"$f":"AVERAGE(C51:D51)","v":0.47336363636363632},{"$f":"IF(E51>=0.7,\"A\",IF(E51>=0.4,\"B\",\"C\"))","v":"B"}]
["Росстат","Прав",0.78900000000000003,0.81818181818181823,{"$f":"AVERAGE(C52:D52)","v":0.80359090909090913},{"$f":"IF(E52>=0.7,\"A\",IF(E52>=0.4,\"B\",\"C\"))","v":"A"}]
["Ростехнадзор","Прав",0.64900000000000002,0.52727272727272723,{"$f":"AVERAGE(C53:D53)","v":0.58813636363636368},{"$f":"IF(E53>=0.7,\"A\",IF(E53>=0.4,\"B\",\"C\"))","v":"B"}]
["Ространснадзор","Прав",0.33300000000000002,0.41818181818181815,{"$f":"AVERAGE(C54:D54)","v":0.37559090909090909},{"$f":"IF(E54>=0.7,\"A\",IF(E54>=0.4,\"B\",\"C\"))","v":"C"}]
["Роструд","Прав",0.877,0.5636363636363636,{"$f":"AVERAGE(C55:D55)","v":0.72031818181818186},{"$f":"IF(E55>=0.7,\"A\",IF(E55>=0.4,\"B\",\"C\"))","v":"A"}]
["Ростуризм","Прав",0.64900000000000002,0.4,{"$f":"AVERAGE(C56:D56)","v":0.52449999999999997},{"$f":"IF(E56>=0.7,\"A\",IF(E56>=0.4,\"B\",\"C\"))","v":"B"}]
["Росфинмониторинг","През",0.52600000000000002,"-",{"$f":"AVERAGE(C57:D57)","v":0.52600000000000002},{"$f":"IF(E57>=0.7,\"A\",IF(E57>=0.4,\"B\",\"C\"))","v":"B"}]
["СВР России","През",0,"-",{"$f":"AVERAGE(C58:D58)","v":0},"N/A","рейтинг не присваивается"]
["Управление делами Президента Российской Федерации","През",0,0.21818181818181817,{"$f":"AVERAGE(C59:D59)","v":0.10909090909090909},{"$f":"IF(E59>=0.7,\"A\",IF(E59>=0.4,\"B\",\"C\"))","v":"C"}]
["ФАДН России","Прав",0.54400000000000004,0.21818181818181817,{"$f":"AVERAGE(C60:D60)","v":0.38109090909090909},{"$f":"IF(E60>=0.7,\"A\",IF(E60>=0.4,\"B\",\"C\"))","v":"C"}]
["ФАС России","Прав",0.89500000000000002,0.49090909090909091,{"$f":"AVERAGE(C61:D61)","v":0.69295454545454549},{"$f":"IF(E61>=0.7,\"A\",IF(E61>=0.4,\"B\",\"C\"))","v":"B"}]
["Федеральная пробирная палата","Прав",0,1.8181818181818181E-2,{"$f":"AVERAGE(C62:D62)","v":9.0909090909090905E-3},{"$f":"IF(E62>=0.7,\"A\",IF(E62>=0.4,\"B\",\"C\"))","v":"C"}]
["ФМБА России","През",0.50900000000000001,0.32727272727272727,{"$f":"AVERAGE(C63:D63)","v":0.41813636363636364},{"$f":"IF(E63>=0.7,\"A\",IF(E63>=0.4,\"B\",\"C\"))","v":"B"}]
["ФНС России","Прав",0.47399999999999998,0.58181818181818179,{"$f":"AVERAGE(C64:D64)","v":0.52790909090909088},{"$f":"IF(E64>=0.7,\"A\",IF(E64>=0.4,\"B\",\"C\"))","v":"B"}]
["ФСБ России","Прав",0,0.25454545454545452,{"$f":"AVERAGE(C65:D65)","v":0.12727272727272726},"N/A","рейтинг не присваивается"]
["ФСВТС России","През",0,"-",{"$f":"AVERAGE(C66:D66)","v":0},{"$f":"IF(E66>=0.7,\"A\",IF(E66>=0.4,\"B\",\"C\"))","v":"C"}]
["ФСИН России","През",0.57899999999999996,0.38181818181818183,{"$f":"AVERAGE(C67:D67)","v":0.4804090909090909},{"$f":"IF(E67>=0.7,\"A\",IF(E67>=0.4,\"B\",\"C\"))","v":"B"}]
["ФСО России","През",0,"-",{"$f":"AVERAGE(C68:D68)","v":0},"N/A","рейтинг не присваивается"]
["ФССП России","През",0.50900000000000001,0.49090909090909091,{"$f":"AVERAGE(C69:D69)","v":0.49995454545454543},{"$f":"IF(E69>=0.7,\"A\",IF(E69>=0.4,\"B\",\"C\"))","v":"B"}]
["ФСТЭК России","През",0,"-",{"$f":"AVERAGE(C70:D70)","v":0},{"$f":"IF(E70>=0.7,\"A\",IF(E70>=0.4,\"B\",\"C\"))","v":"C"}]
["ФТС России","Прав",0.78900000000000003,0.36363636363636365,{"$f":"AVERAGE(C71:D71)","v":0.57631818181818184},{"$f":"IF(E71>=0.7,\"A\",IF(E71>=0.4,\"B\",\"C\"))","v":"B"}]

{"sheet":"Коды","index":1,"n_rows":161,"n_cols":5,"rows_kept":161,"cut":false,"hidden":false,"merged":[[38,0,38,2],[39,0,39,2],[40,0,43,0],[40,1,43,1],[8,1,10,1],[44,0,59,0],[44,1,45,1],[46,1,49,1],[50,1,53,1],[54,1,56,1],[57,1,59,1],[60,0,88,0],[60,1,62,1],[63,1,66,1],[67,1,70,1],[71,1,74,1],[75,1,77,1],[79,1,81,1],[82,1,84,1],[85,1,88,1],[89,0,98,0],[89,1,92,1],[93,1,94,1],[95,1,98,1],[99,0,99,2],[100,0,100,2],[101,0,120,0],[101,1,102,1],[103,1,104,1],[105,1,112,1],[114,1,116,1],[117,1,118,1],[119,1,120,1],[132,0,156,0],[132,1,134,1],[135,1,138,1],[139,1,142,1],[143,1,144,1],[145,1,147,1],[148,1,149,1],[150,1,153,1],[154,1,156,1],[157,0,157,1],[17,3,24,3],[11,3,16,3],[25,1,26,1],[27,1,29,1],[30,1,31,1],[22,1,24,1],[19,1,21,1],[17,1,18,1],[14,1,16,1],[11,1,13,1],[25,0,31,0],[121,0,131,0],[121,1,123,1],[126,1,128,1],[129,1,130,1],[8,3,10,3],[2,3,7,3],[25,3,26,3],[27,3,29,3],[30,3,31,3],[6,1,7,1],[2,1,5,1],[2,0,10,0],[11,0,16,0],[17,0,24,0]]}
["ОЦЕНКА СОЦСЕТЕЙ ФОИВ "]
["Блок оценки","Критерий оценки","Баллы","Примечание"]
["Информирование","Наличие аккаунта и ссылка на аккаунт на официальном сайте","3 – более 4 ключевых","Оценивается экспертно"]
[null,null,"2 – 4 ключевых"]
[null,null,"1 – менее 4 ключевых"]
[null,null,"0 – ни одного аккаунта"]
[null,"На странице есть адрес, телефон, время работы, ссылка на сайт","1 – есть хотя бы в одной сети"]
[null,null,"0 – нет ни в одной сети"]
[null,"В каждом аккаунте есть ежедневные посты по будням","2 –  чаще одного раза в неделю","Оценивается экспертно, но проверяется по метрикам (кол-во постов/кол-во недель) "]
[null,null,"1 – чаще одного раза в месяц"]
[null,null,"0 – последний пост больше месяца назад"]
["Соучастие","Средний ERR = ((Сумма лайков за весь период + сумма репостов за весь период + сумма комментариев за весь период)/охват)*100%","2 - лучше коридора нормы","Период оценки 1 сентября - 28 февраля. Инструмент оценки: Popster.ru. Для финальной оценки используются максимальные значения ERR и TR из 4 возможных значений. ","Норма для ERR = 2,0-2,5, для Erpost = 0,5-0,8"]
[null,null,"1 - в пределах нормы"]
[null,null,"0 - ниже показателя нормы "]
[null,"TR = (Сумма комментариев/кол-во подписчиков/кол-во публикаций за анализируемый период)*100%","2 - лучше коридора нормы",null,"Норма для TR = 0,01-0,03"]
[null,null,"1 - в пределах нормы"]
[null,null,"0 - ниже показателя нормы "]
["Консультирование","Реакция на комментарии: ведомство отвечает на содержательные комментарии полноценно и содержательно, разъясняя суть вопроса ","1 - отвечает в большинстве случаев (более 50% содержательных комментариев имеют ответами администратора) ","Оценивается экспертно. Период оценки 1 сентября - 28 февраля. Экспертом просматриваются все посты в самой популярной соцсети (по кол-ву подписчиков) каждого ведомства за период"]
[null,null,"0 - ведомство не реагирует на комментарии вообще"]
[null,"Возможность написать личное сообещние ведомтсву через натиыные  инструменты социальных сетей","2 – 4 ключевых"]
[null,null,"1 – менее 4 ключевых"]
[null,null,"0 – ни одного аккаунта"]
[null,"Реакция на запрос через инструмент обратной связи (оценивается ВК как самая популярная в РФ, ЛИБО та, в которой у ФОИВа больше всего подписчиков). Период ожидания ответа: 10 дней ","2 – полный и подробный ответ (включая ссылки)"]
[null,null,"1 – формальный ответ (включая ответ, сформирвоанный ботом)"]
[null,null,"0 – отсутствие ответа или ответ бота формата «Мы работаем над вашим запросом)"]
["Формат постинга","Формат текста: соответствие текста поста ТОВ соцсетей, наличие СТА, текст не является перепечаткой пресс-релиза/новости с сайта","1 - соответствует ","Оцниватся экспертно. Для оценки отбираются три поста в периоде оценки 1 сентября - 28 февраля. Посты отбираются из самой популярной соцсети (по кол-ву подписчиков) каждого ведомства"]
[null,null,"0 - не соответствует (посты - это перепечатка релиза/новости, без обработки)"]
[null,"Читабельность текста","2 - лучше коридора нормы","Оцениватеся машинно, через сервис проверки текстов. \"Коридор нормы\" формируется по итогам общей оценки всех ФОИВ. Jцниватся экспертно. Для оценки отбираются три поста в периоде оценки 1 сентября - 28 февраля."," Норма читабельности 12-15 баллов http://ru.readability.io"]
[null,null,"1 - в пределах нормы"]
[null,null,"0 - ниже показателя нормы "]
[null,"Формат визуального сопровождения: есть изображение/галерея, видео, сниппет","1 - соответствует ","Оцниватся экспертно. Для оценки отбираются три поста в периоде оценки 1 сентября - 28 февраля."]
[null,null,"0 - не соответствует (низкое качество изображений, нет визуального сопровождения, ссылки прикреплены без предпросмотра и тд) "]
[null,"Максимум",19]
[]
[]
[]
["ОЦЕНКА ОБЩЕСТВЕННЫХ СОВЕТОВ ПРИ ФОИВ "]
["Блок оценки","Критерий оценки","Баллы"]
["Оценка ОС как органа гражданского участия"]
["(максимум 27 баллов)"]
["1. Сайт ОС","Наличие отдельного сайта либо раздела ОС на сайте ФОИВ","2 – отдельный сайт ОС"]
[null,null,"1 – раздел на сайте ФОИВ"]
[null,null,"0 – сайт или раздел отсутствуют"]
[]
["2. Доступность и полнота информации о членах ОС","Перечень лиц, входящих в текущий состав общественного совета","1 – да "]
[null,null,"0 – нет"]
[null,"Указание на организацию, должность лиц, входящих в состав общественного совета","2 – информация об организациях и должностях указана полностью для всех членов совета. "]
[null,null,"1 – для половины и более членов совета информация указана полностью, для оставшихся - частично (например, указана организация и не указана должность)."]
[null,null,"0 – информация отсутствует "]
[]
[null,"Краткие биографии всех членов ОС с указанием предыдущих мест работы, в том числе с обязательным указанием факта и периода работы в органах государственной власти или на публичных должностях*","2 – информация об организациях и должностях указана полностью для всех членов совета."]
[null,null,"1 – для половины и более членов совета информация указана полностью, для оставшихся - частично (например, указана только часть биографии)."]
[null,null,"0 – информация отсутствует"]
[]
[null,"Фотографии лиц, входящих в состав общественного совета","1 – фотографии есть не менее, чем у половины членов общественного совета."]
[null,null,"0 – фотографий нет фотографии есть менее чем у половины членов общественного совета"]
[]
[null,"Контактная информация членов общественного совета (электронный адрес, мессенджеры)*","1 – информация есть не менее, чем у половины членов общественного совета."]
[null,null,"0 – информации нет или информация есть менее чем у половины членов общественного совета"]
[]
["3.  Доступность и полнота информации о работе ОС","Положение об общественном совете","1 – размещена текущая версия Положения. "]
[null,null,"0 – положение в открытом доступе не размещено"]
[]
[null,"Наличие на сайте ведомства отдельной новостной ленты, посвященной работе общественного совета","2 – отдельная лента есть, в ней присутствуют достаточно регулярные публикации о деятельности совета в текущем году и предыдущем году. "]
[null,null,"1 – отдельная лента отсутствует, но на сайте ведомства встречаются новостные публикации о деятельности общественного совета, за исключением факта его учреждения или изменения в составе. "]
[null,null,"0 – отдельная лента отсутствует, на сайте ведомства не встречаются публикации о деятельности совете, за исключением факта его учреждения или изменения в составе"]
[]
[null,"План предстоящих заседаний общественного совета (2021 год)","2 – размещен план в разрезе месяцев. "]
[null,null,"1 – размещен ежеквартальный план, о ежемесячной деятельности совета информация отсутствует."]
[null,null,"0 – план отсутствует в открытом доступе"]
[]
[null,"Повестки предстоящих заседаний общественного совета (2021 год)","2 – повестки публикуются к каждому заседанию совета, публикация происходит не менее, чем за 3 рабочих дня до заседания"]
[null,null,"1 – повестки публикуются не к каждому заседанию или их публикация происходит менее, чем за 3 рабочих дня до заседания"]
[null,null,"0 – повестки не публикуются "]
[]
[null,"Протоколы и решения прошедших заседаний общественного совета (2020 год)*","2 – протоколы и решения размещены не менее, чем для 2/3 заседаний совета. "]
[null,null,"1 – протоколы и решения размещены не менее, чем для 1/3 заседаний"]
[null,null,"0 – протоколы и решения размещены менее, чем для 1/3 заседаний или не размещаются "]
[]
[null,"Проводятся ли трансляции заседаний на сайте ОС или в соцсетях*","1 – трансляции проводятся не менее, чем для половины заседаний "]
[null,null,"0 – трансляции не проводятся или проводятся менее, чем для половины заседаний"]
[]
[null,"Наличие видеозаписей заседаний ОС на сайте*","1 – размещены видеозаписи не менее, чем половины заседаний. "]
[null,null,"0 – видеозаписи не размещены или размещены, менее, чем для половины заседаний"]
[]
[null,"Наличие информации о работе предыдущих составов ОС*","2 – размещены полные перечни лиц, входящих в предыдущие составы совета, а также все предыдущие версии Положений об ОС."]
[null,null,"1 – размещена одна из категорий информации, перечисленных выше."]
[null,null,"0 – не размещено"]
[]
["4. Доступность коммуникации с членами ОС","Текст правового акта, регламентирующий порядок участия в открытых заседаниях общественного совета, либо описание порядка участия.","2 – в публичном доступе размещен отдельный акт, описывающий порядок участия."]
[null,null,"1 – возможность участия прописана в Положении совета, документ, описывающий порядок такого участия отсутствует. "]
[null,null,"0 – возможность участия не прописана в Положении совета"]
[]
[null,"Возможность обращения в общественный совет (его структурное подразделение) через сайт или электронную почту","1 – да"]
[null,null,"0 – нет"]
[null,"Наличие на сайте или в соцсетях открытой дискуссионной площадки для обсуждения предложений и заключений общественного совета по разрабатываемым органом власти проектам НПА, документам и инициативам (чат, форум)*","2 – площадка создана, на ней проводились регулярные обсуждения в текущем и предыдущем году. "]
[null,null,"1 – площадка создана, но обсуждения на ней проводятся не регулярно на ней проводились регулярные обсуждения в текущем и предыдущем году (например, нет обсуждений в текущем году, есть только за предыдущие периоды)."]
[null,null,"0 – площадка не создана или создана, но обсуждения не ведутся"]
[]
["Оценка ОС как органа гражданского контроля"]
["(максимум: 28 баллов)"]
["5. Степень независимости ОС от ФОИВ","Наличие норм в Положении об ОС о необходимости формирования части состава ОС из представителей НКО*","1 – да"]
[null,null,"0 – нет"]
[null,"Наличие общественных деятелей, представителей НКО в составе ОС","1 – да"]
[null,null,"0 – нет"]
[null,"Открытость и понятность процедуры формирования состава совета в Положении об ОС*","3 – в Положении совета зафиксированы: "]
[null,null,"-  ясные требования к кандидатам в члены ОС, в том числе указание на то, кто не может стать членом ОС"]
[null,null,"- детализированная процедура номинации кандидатов в члены ОС и их включения в состав ОС, в том числе через процедуру голосования (если это применимо)."]
[null,null,"- требования о том, что кандидаты в члены ОС не могут быть исключены (отведены) из процедуры формирования ОС представителями ведомства или Общественной палаты.  "]
[null,null,"2 – в Положении о совете зафиксированы любые 2 пункта из описания выше "]
[null,null,"1 – в Положении о совете зафиксирован любой один пунктов из описания выше. "]
[null,null,"0 – ни один из пунктов, описанных выше не включен в Положение совета. "]
[]
[]
[null,"Наличие сообщений в новостных лентах ФОИВ и ОС о начале приема заявок в новый состав ОС *","2 – на сайте ФОИВ и ОС"]
[null,null,"1 – на одном из сайтов"]
[null,null,"0 – нет"]
[null,"Отсутствие в составе ОС сотрудников подведомственных организаций или представителей зависимых организаций*","1 – отсутствуют "]
[null,null,"0 – присутствуют"]
[null,"Сообщения в СМИ о нарушениях в работе ОС, о вмешательстве ФОИВ в работу ОС или в процесс формирования его состава","1 – отсутствуют"]
[null,null,"0 – присутствуют"]
["6. Степень влияния ОС на деятельность ФОИВ","Включение руководителя, заместителя руководителя ОС в состав коллегии ФОИВ","2 – на постоянной основе"]
[null,null,"1 – по согласованию"]
[null,null,"0 – нет"]
[]
[]
[null,"Участие руководителя ФОИВ в заседаниях ОС*","2 – да, в более, чем половине всех прошедших за год заседаний "]
[null,null,"1 – да, в менее, чем половине всех прошедших за год заседаний"]
[null,null,"0 – нет"]
[null,"Наличие на сайте ОС или ФОИВ реакции руководства ФОИВ на рекомендации ОС (0, 1)*","1 – да"]
[null,null,"0 – нет"]
[]
["7. Степень активности ОС","Частота заседаний ОС, проведенных в течение предыдущего года ","2 – да, чаще, чем раз в квартал"]
[null,null,"1 – да, раз в квартал"]
[null,null,"0 – реже, чем раз в квартал или не проводились"]
[null,"Использование очных[1] форматов заседаний ОС ","2 – более половины заседаний ОС проводились очно (наличие материалов, указывающих на очную форму участия членов ОС в заседаниях)."]
[null,null,"1 – менее половины, но не менее двух заседаний ОС за год проводилось в очном формате. "]
[null,null,"0 – очные заседания не проводились "]
[]
[null,"Присутствует ли в повестках ОС вопросы, поднятые по инициативе членов ОС*","2 – да, на более, чем половине заседаний"]
[null,null,"1 – да, на менее, чем половине заседаний"]
[null,null,"0 – нет"]
[]
[null,"Направляются ли рекомендации ОС в адрес ФОИВ, его руководителя или заместителей*","1 – да"]
[null,null,"0 – нет "]
[null,"Выражали ли члены ОС позицию по наиболее резонансным вопросам деятельности ведомства в публичном пространстве, в том числе в СМИ","2 – выражали позицию два и более членов совета"]
[null,null,"1 – выражал позицию хотя бы один из членов совета"]
[null,null,"0 – нет"]
[null,"Присутствуют ли на заседаниях общественные организации, не представленные в составе ОС*","1 – да"]
[null,null,"0 – нет"]
[null,"Присутствуют ли на заседаниях представители СМИ*","2 – да, в том числе негосударственные СМИ"]
[null,null,"1 – да, присутствуют только государственные СМИ"]
[null,null,"0 – не присутствуют"]
[]
[null,"Наличие ежегодного формата публичной отчетности председателя ОС (пресс-конференции)*","2 – в формате пресс-конференции или ином публичном формате"]
[null,null,"1 – в виде отчета на сайте"]
[null,null,"0 – нет"]
["Максимум",null,58]
[]
[]
["[1] Очное заседание может быть проведено как с личным офлайн присутствием членов совета, так и с помощью средств онлайн видеосвязи."]

{"sheet":"Соцсети","index":2,"n_rows":72,"n_cols":43,"rows_kept":72,"cut":false,"hidden":false,"merged":[[0,40,0,42],[0,25,0,39],[0,0,1,0],[0,1,0,7],[0,8,0,21],[0,22,0,24]]}
["Ведомство","Информирование",{"$nulls":6},"Соучастие",{"$nulls":13},"Консультирование",null,null,"Формат",{"$nulls":14},"ИТОГ"]
[null,"Ссылка VK (кол-во подписчиков)","Ссылка FB (кол-во подписчиков)","Ссылка OK (кол-во подписчиков)","Ссылка Inst (кол-во подписчиков)","Наличие аккаунта","Заполненность информации в аккаунте","Частота постинга","ERR_VK","ERpost_VK","TR _VK","ERR_Fb","Erpost_FB","TR_Fb","ERR_Ок","Erpost_OK","TR_Ok","ERR_Inst","Erpost_Inst","TR_Inst","ERR//ERpost_Итог","TR_rate_Итог","Реакция на комментарии","Возможность написать ","Качество ответа","Проверочный пост 1","Формат поста ","Читабельность","Формат визуала","Проверочный пост 2","Формат поста ","Читабельность","Формат визуала","Проверочный пост 3","Формат поста ","Читабельность","Формат визуала","Формат поста Итог","Читабельность Итог ","Формат визуала Итог","Максимум","Итог","Rate"]
["Главное управление специальных программ Президента Российской Федерации (ГУСП)",0,0,0,0,0,0,0,0,0,0,0,0,0,0,0,0,0,0,0,0,0,0,0,0,0,0,0,0,0,0,0,0,0,0,0,0,0,0,0,19,0,0]
["Государственная фельдъегерская служба Российской Федерации (ГФС России)",0,0,0,0,0,0,0,0,0,0,0,0,0,0,0,0,0,0,0,0,0,0,0,0,0,0,0,0,0,0,0,0,0,0,0,0,0,0,0,19,0,0]
["Казначейство России",0,"1947  https://www.facebook.com/FederalTreasury/?fref=ts ","-","17,5 тыс   https://www.instagram.com/roskazna/ ",1,1,2,0,0,0,0,0.76300000000000001,1.2E-2,0,0,0,0,2.5760000000000001,1.2999999999999999E-2,2,1,0,1,0,"https://www.instagram.com/p/CGSXDSeHan6/",0,12.55,1,"https://www.instagram.com/p/CGaHPSIHvYx/",0,22.42,1,"https://www.instagram.com/p/CF4-V2psjFL/",0,21.71,1,0,0,1,19,9,0.47368421052631576]
["МВД России","235 131 (https://vk.com/mvd)","19 246 (https://www.facebook.com/mvd.official)","203 071 (https://ok.ru/mvd/members)","287 тыс (https://www.instagram.com/mvd.russia/)",3,1,2,1.0957117334246682,0.107,0,4.8262008540008354,0.38900000000000001,2.3E-2,0.81624693968640649,7.0000000000000007E-2,4.4191899999999998E-4,39.977248053957915,0.52200000000000002,7.7631430000000001E-3,2,1,1,1,1,"https://vk.com/wall-26323016_38167",0,10.26,1,"https://vk.com/wall-26323016_38149",1,14.31,0,"https://vk.com/wall-26323016_38536",1,21.71,1,0.66666666666666663,0,0.66666666666666663,19,13.333333333333332,0.70175438596491224]
["МИД России","409 502 (https://vk.com/mid)","436 002 (https://www.facebook.com/MIDRussia)","-","374 тыс. (https://www.instagram.com/mid.rus/)",1,1,2,2.0030806563765347,1.7999999999999999E-2,2.6519413908223308E-3,0.16293515727188107,"0.077",7.0072571730667556E-3,0,0,0,45.509435705541314,0.37,1.4588729488005672E-2,1,1,0,1,0,"https://vk.com/wall-70034991_461159",1,11.75,1,"https://vk.com/wall-70034991_456350",1,12.9,1,"https://vk.com/wall-70034991_454561",1,17.170000000000002,1,1,1,1,19,10,0.52631578947368418]
["Минвостокразвития России","94 (https://vk.com/minvostok)","5 107 (https://www.facebook.com/MinVostok/)","-","4 142 (https://www.instagram.com/minvostok/)",1,1,0,2.9851434898957274,7.86,9.0968161143599735E-2,0,0.27300000000000002,3.9246467817896386E-3,0,0,0,6.6797242243810713,2.359,7.9000000000000001E-2,2,2,null,null,null,"https://www.facebook.com/302809000547761/posts/842285533266769",0,10.07,1,"https://www.facebook.com/302809000547761/posts/806040836891239",0,13.16,1,"https://www.facebook.com/302809000547761/posts/791191818376141",0,17.73,1,0,1,1,19,8,0.42105263157894735]
["Минздрав России","115 405 (https://vk.com/minzdravru)","315 429 (https://www.facebook.com/MinzdravRu/?fref=ts)","157 451 (https://ok.ru/minzdravru)","236 тыс. (https://www.instagram.com/rosminzdrav.ru/)",3,1,2,0,0.22900000000000001,0.04,0,2.1989999999999998,0.35699999999999998,0,6.8000000000000005E-2,1.2999999999999999E-2,0,0.50800000000000001,0.05,2,2,0,1,0,"https://vk.com/wall-114069515_19814",1,10.88,1,"https://vk.com/wall-114069515_13080",1,16.98,1,"https://vk.com/wall-114069515_9918",1,10.26,1,1,2,1,19,15,0.78947368421052633]
["Минкультуры России","40 862 (https://vk.com/public56049514)","17 930 (https://www.facebook.com/minkultrf)","54 020 (https://ok.ru/mkrf/)","120 тыс (https://www.instagram.com/mincult_russia/?hl=ru)",3,1,2,5.226836379716512,0.22800000000000001,3.5045194793499757E-3,0.86762925587421347,0.41099999999999998,8.533881451477288E-3,0.15812648429335668,0.42,1.0722444185487302E-3,4.7828502228500289,0.82399999999999995,2.5000000000000001E-2,2,0,0,1,0,"https://vk.com/wall-56049514_21502",0,17.329999999999998,1,"https://vk.com/wall-56049514_20748",0,21.96,1,"https://vk.com/wall-56049514_20468",1,9.73,1,0.33333333333333331,0,1,19,10.333333333333332,0.54385964912280693]
["Минобороны России","440 625 (https://vk.com/mil)","299 491 (https://www.facebook.com/mod.mil.rus/)","50 888 (https://ok.ru/mil)","486 тыс (https://www.instagram.com/mil_ru/)",3,1,2,21.26945722,7.2999999999999995E-2,4.7708041927709867E-3,8.1308956614899532,0.21,1.193743060174325E-2,14.895954353738553,7.0999999999999994E-2,5.3694552595794859E-3,2.5485478229999998,0.92900000000000005,1.4E-2,2,1,0,2,1,"https://vk.com/wall-133441491_399561",0,12.55,1,"https://vk.com/wall-133441491_393353",1,6.3,1,"https://vk.com/wall-133441491_404359",1,11.13,1,0.66666666666666663,2,1,19,15.666666666666666,0.82456140350877194]
["Минобрнауки России","27 933 (https://vk.com/minobrnauki)","5 447 (https://www.facebook.com/minobrnaukigov/)","15 591 (https://ok.ru/group/63697153490997)","66,6 тыс. (https://www.instagram.com/minobrnauki_russia/)",3,1,2,3.8201609027530727,0.35699999999999998,2.9000000000000001E-2,3.0078488028954617,0.69899999999999995,0.02,0.19508239277401951,3.7999999999999999E-2,2E-3,2.7958805158476783,0.42799999999999999,1.2E-2,2,1,0,2,0,"https://vk.com/wall-167915299_4317",1,28.7,1,"https://vk.com/wall-167915299_9086",1,10.26,1,"https://vk.com/wall-167915299_4217",1,12.55,1,1,0,1,19,13,0.68421052631578949]
["Минприроды России","171 (https://vk.com/min_prirody)","8 408 \n(https://www.facebook.com/mnr.gov)","https://ok.ru/profile/591063362109 (заведена как личная страница - не возможно снять метрики)","10.5 тыс\n(https://www.\ninstagram.\ncom/min.\nprirody/)",3,1,1,56.999999999999993,16.010999999999999,0.5617977528089888,717.1503957783641,0.46,4.2004708592334142E-2,0,0,0,56,1.5409999999999999,0.187,2,2,0,1,0,"https://www.instagram.com/p/CHYBWnVleEj/",1,7.27,1,"https://www.instagram.com/p/CIvuWpMFgqo/",1,12.55,1,"https://www.instagram.com/p/CHckxPllmi3/",1,0,1,1,2,1,19,14,0.73684210526315785]
["Минпромторг России","23 311\n\nhttps://vk.com/\nminpromtorgrus","36 747\n\nhttps://www.facebook.\ncom/minpromtorg","-","65,9 тыс.\nhttps://www.\nnstagram.com/\nminpromtorg/",1,1,2,0,0.155,1.4E-2,0,0.13900000000000001,5.0000000000000001E-3,0,0,0,0,0.61499999999999999,1.7000000000000001E-2,1,1,0,1,0,"https://www.\ninstagram.com/p/\nCGu_5w7HtxE/",1,13.68,1,"https://www.\ninstagram.com/p/\nCI3FAItBQt-/",1,19.420000000000002,1,"https://www.\ninstagram.com/p/\nCG4Wu43nAO-/",1,13.31,1,1,0,1,19,9,0.47368421052631576]
["Минпросвещения России","393 020\n\nhttps://vk.com/\nminprosvet","34 696\n\nhttps://ru-ru.facebook.\ncom/minprosvet/","115 740\n\nhttps://ok.ru/\nminprosvet","184 тыс.\n\nhttps://www.\ninstagram.com/\nminprosvet/",3,1,2,0.93501775118464314,0.1,5.5788794357527127E-3,10.609940725154603,0.14699999999999999,4.7083676191450726E-3,2.2402827835406662,1.4E-2,5.535050708612287E-4,53.600749640876359,0.33,1.2E-2,2,1,0,2,1,"https://vk.com/wall-30558759_2221455",0,11.91,1,"https://vk.com/minprosvet?w=wall-30558759_224603",1,11.91,1,"https://vk.com/wall-30558759_217871",1,12.55,1,0.66666666666666663,1,1,19,14.666666666666666,0.77192982456140347]
["Минсельхоз России","6 510 \n\nhttps://vk.com/\nminselhoz","8 527\n\nhttps://www.facebook.\ncom/minselhoz/"," 1 542\n\nhttps://ok.ru/\ngroup/\n58417191\n780400","44,4 тыс. \n\nhttps://www.\ninstagram.\ncom/mcx_rf/",3,1,2,0,0.57099999999999995,0.02,0,0.80200000000000005,2.4E-2,0,0.152,2E-3,0,0.83199999999999996,1.0999999999999999E-2,2,1,0,1,0,"https://www.\ninstagram.com/p\n/CLubSnmnzCA/",1,14.93,1,"https://www.instagram.\ncom/p/CLcicp2n-Q_/",1,12.55,1,"https://www.instagram.com/p/CF9nyOWHHUC/",1,10.07,1,1,1,1,19,13,0.68421052631578949]
["Минспорт России","48 774\n\nhttps://vk.com/\nminsportrf","1 824\n\nhttps://www.facebook.\ncom/minsportrf/","-","49 тыс. \n\nhttps://www.\ninstagram.\ncom/minsport\n_rf/\n",1,1,2,2.3832326411979325,0.52500000000000002,5.0000000000000001E-3,5.2198884356853332,0.98,0.02,0,0,0,5.5179754123306353,1.0589999999999999,1.4E-2,2,1,0,1,0,"https://www.i\nnstagram.com/p/\nCGxYIuVj-CB/",1,8.89,1,"https://www.instagram.com/p/CLzZ11IDvfH/",1,6.01,1,"https://www.\ninstagram.com/p/CLz\nZ11IDvfH/",0,14.31,1,0.66666666666666663,2,1,19,11.666666666666666,0.61403508771929827]
["Минстрой России","11 480\n\nhttps://vk.com/\nminstroyrfofficial","19 352\n\nhttps://www.facebook.\ncom/minstroyrf","30 412\n\nhttps://ok.ru/\ngroup/5359\n8208065632","48,3 тыс.\n\nhttps://www.\ninstagram.\ncom/minstroyrf/",3,1,2,0.86795622481648738,0.186,0,1.242575990021499,0.18099999999999999,6.0000000000000001E-3,0,0,0,6.2630000000000008,0.50600000000000001,1.4999999999999999E-2,2,1,0,1,0,"https://www.instagram.com/p/CJWZL5shPql/",0,12.55,1,"https://www.instagram.com/p/CKGaA31h5LZ/",0,13.75,1,"https://www.instagram.com/p/CKzcu_JhutN/",0,13.31,1,0,1,1,19,12,0.63157894736842102]
["Минтранс России","2384\n\nhttps://vk.com/\nmintransrussia"," 3 502\n\nhttps://www.facebook.\ncom/MintransRussia","-","35,6 тыс. \n\nhttps://www.\ninstagram.\ncom/\nmintransrussia/",1,1,2,3.3130000000000002,0.47099999999999997,3.3000000000000002E-2,5.3970000000000002,0.51600000000000001,1.7999999999999999E-2,0,0,0,3.78,0.72799999999999998,8.9999999999999993E-3,2,2,0,1,0,"https://www.instagram.com/p/CHaqCDUFLxt/",0,10.68,1,"https://www.instagram.com/p/CHuqJYDFx41/",1,0.05,1,"https://www.instagram.com/p/CKhYkbplgB3/",0,12.55,1,0.33333333333333331,2,1,19,12.333333333333334,0.64912280701754388]
["Минтруд России","3217 \n\nhttps://vk.com/\nmintrudrf","707\n\nhttps://www.facebook.\ncom/mintrudrf/","362\n\nhttps://ok.ru/\ngroup/5729314\n7603099","12,5 тыс https://www.instagram.com/mintrudrf/",3,1,1,12.304483837330551,1.5249999999999999,2.5999999999999999E-2,5.0803300043421631,2.5209999999999999,4.2999999999999997E-2,1.6877220686932488,0.79800000000000004,7.9000000000000001E-2,2.0914822266934943,0.69799999999999995,3.2000000000000001E-2,2,2,0,2,0,"https://www.instagram.com/p/CMUIb1Lqzy0/",1,22.59,1,"https://www.instagram.com/p/CNF-ZPcM1D8//",1,8.89,1,"https://www.instagram.com/p/CMt_F88CEuj/",1,8.89,1,1,1,1,19,14,0.73684210526315785]
["Минфин России","9600     https://vk.com/ruminfin ","7260     https://www.facebook.com/ruminfin/","-","72 тыс     https://www.instagram.com/ruminfin/",1,1,2,4.8970000000000002,0.51,1.7000000000000001E-2,8.307962925,0.433,0.03,0,0,0,2.750983422,0.46200000000000002,0.01,2,1,0,1,0,"https://www.instagram.com/p/CJOu3_Lj2h9/",1,8.89,1,"https://www.instagram.com/p/CLeswhUDRiF/",1,10.26,1,"https://www.instagram.com/p/CKElx7ujoCW/",0,10.88,1,0.66666666666666663,2,1,19,11.666666666666666,0.61403508771929827]
["Минцифры России","-","5 675 (https://www.facebook.com/minsvyaz.place?fref=ts)","-","6 189 (https://www.instagram.com/minsvyaz_official/)",1,1,1,0,0,0,44.269201685211193,0.38300000000000001,1.7000000000000001E-2,0,0,0,4.8865953109072375,1.177,5.5E-2,2,2,1,1,0,"https://www.facebook.com/203797266309794/posts/3520639344625553",0,24.1,1,"https://www.facebook.com/203797266309794/posts/3666796703343149",1,3,1,"https://www.facebook.com/203797266309794/posts/3663170987039054",1,4.47,1,0.66666666666666663,2,1,19,12.666666666666666,0.66666666666666663]
["Минэкономразвития России","6008     https://vk.com/ministryeconomy ","18708       https://www.facebook.com/MinistryEconomy ","-","43,6 тыс        https://www.instagram.com/minec_russia/ ",1,1,2,8.663484486873509,0.245,1.2999999999999999E-2,1.7729683194377308,0.14000000000000001,7.0000000000000001E-3,0,0,0,2.5287277599303128,0.34899999999999998,1.6E-2,2,1,1,1,2,"https://www.instagram.com/p/CFo7weNjn4x/",1,12.1,1,"https://www.instagram.com/p/CEuLIW5IjEo/",0,18.45,1,"https://www.instagram.com/p/CJOtwcGj5vR/",1,12.55,1,0.66666666666666663,1,1,19,13.666666666666666,0.7192982456140351]
["Минэнерго России","38        https://vk.com/minenergo_rf ","6239     https://www.facebook.com/Minenergo.Gov ","145     https://ok.ru/group/61452899975413 ","26,4 тыс       https://www.instagram.com/minenergogov/",3,1,2,1.6582765768433521,3.0089999999999999,0.27800000000000002,2.5764352674468478,0.36899999999999999,1.0999999999999999E-2,1.5814637734461199,0.91,2.1000000000000001E-2,7.2615971953807872,2.7829999999999999,5.3999999999999999E-2,2,2,1,1,1,"https://www.instagram.com/p/CLCNSDdlp7i/",1,10.88,1,"https://www.instagram.com/p/CFNOxXoF4sq/",1,8.1199999999999992,1,"https://www.instagram.com/p/CI3rgziluUv/",1,6.3,1,1,2,1,19,17,0.89473684210526316]
["Минюст России",0,0,0,0,0,0,0,0,0,0,0,0,0,0,0,0,0,0,0,0,0,0,0,0,0,0,0,0,0,0,0,0,0,0,0,0,0,0,0,19,0,0]
["МЧС России","218293   https://vk.com/mchs__russia ","23841     https://www.facebook.com/MchsRussia ","57780  https://ok.ru/mchsrussia ","136 тыс    https://www.instagram.com/mchs.russia/ ",3,1,2,0,0.128,4.0000000000000001E-3,0,0.14799999999999999,2E-3,0,4.1000000000000002E-2,1E-3,0,0.93700000000000006,1.7000000000000001E-2,2,1,0,1,0,"https://www.instagram.com/p/CGZdUklheiK/",1,8.39,1,"https://www.instagram.com/p/B81Z6VHlVM1/",1,7.27,1,"https://www.instagram.com/p/CLWvTReFh77/",1,13.31,1,1,2,1,19,14,0.73684210526315785]
["Росавиация","728 https://vk.com/favt_ru (на сайте ссылки на ВК нет)","990 https://www.facebook.com/favtrf/",0,0,1,1,2,0,0,0,0,8.5999999999999993E-2,5.0000000000000001E-3,0,0,0,0,0,0,0,0,0,0,0,"https://www.facebook.com/favtrf/posts/1268677466845364",0,0,0,"https://www.facebook.com/favtrf/posts/1184473038599141",0,0,0,"https://www.facebook.com/favtrf/posts/1201607503552361",0,0,0,0,0,0,19,4,0.21052631578947367]
["Росавтодор","166048 https://vk.com/rosavtodor","60492 https://www.facebook.com/rosavtodor/","35509 https://ok.ru/rosavtodor","82 тыс. https://www.instagram.com/rosavtodor/",3,1,2,1.3652188458709755,0.187,5.0704734308040483E-2,3.6535269006640467,7.8E-2,1.6283414E-2,0.41967375327555506,3.2000000000000001E-2,1.8174370000000001E-3,3.344189396,0.748,4.9162916000000001E-2,2,2,1,2,2,"https://vk.com/wall-67937894_88991",1,11.58,1,"https://vk.com/wall-67937894_93639",1,9.18,1,"https://vk.com/wall-67937894_91597",1,4.47,1,1,2,1,19,19,1]
["Росаккредитация",0,"869 https://www.facebook.com/rusaccreditation",0,"1721 https://www.instagram.com/fsa.gov.ru/",1,1,2,0,0,0,3.7699293642785072,1.304,2.4E-2,0,0,0,0,3.2280000000000002,1.4999999999999999E-2,2,1,0,1,0,"https://www.instagram.com/p/CKLZkj8jSae/",1,17.73,1,"https://www.instagram.com/p/CIJJQlTDMe9/",1,19.82,1,"https://www.instagram.com/p/CK4FEpmDzDt/",1,0,1,1,1,1,19,11,0.57894736842105265]
["Росалкогольрегулирование","1233 https://vk.com/fsrarru","489 https://www.facebook.com/fsrar.ru/",0,"1504 https://www.instagram.com/fsrar.ru/",1,1,2,1.4113137414333836,0.159,1.6E-2,2.6498266468548786,0.23599999999999999,4.0000000000000001E-3,0,0,0,1.6373598957707693,1.831,1.2E-2,2,1,0,1,2,"https://vk.com/wall-109697745_1100",0,19.010000000000002,0,"https://vk.com/wall-109697745_1159",0,16.350000000000001,0,"https://vk.com/wall-109697745_1166",0,17.989999999999998,0,0,0,0,19,10,0.52631578947368418]
["Росархив","3906 https://vk.com/rusarchives",0,0,0,1,0,2,0,2.0419999999999998,2.4E-2,0,0,0,0,0,0,0,0,0,1,1,0,1,2,"https://vk.com/wall-164851212_516",1,10.88,1,"https://vk.com/wall-164851212_563",1,8.89,1,"https://vk.com/wall-164851212_536",1,11.13,1,1,2,1,19,12,0.63157894736842102]
["Росводресурсы","115 https://vk.com/rosvodresursy (на сайте ссылки нет)","115 https://www.facebook.com/rosvodresursy (на сайте ссылки нет)","-","1238 https://www.instagram.com/rosvodresursy/ (на сайте ссылки нет)",1,1,2,29.641930461857807,6.7329999999999997,0.32500000000000001,51.699716713881017,5.3339999999999996,7.2999999999999995E-2,0,0,0,441.08781127129754,4.1239999999999997,0.123,2,2,1,1,0,"https://www.instagram.com/p/CKlxSQKnIgx/",1,9.43,1,"https://www.instagram.com/p/CKTdM7KH26-/",1,7.27,1,"https://www.instagram.com/p/CE9pueqoHoa/",1,8.39,1,1,2,1,19,14,0.73684210526315785]
["Росгвардия","69052 https://vk.com/rosgvard_official",0,"467 https://ok.ru/rosgvard.official","86131 https://www.instagram.com/rosgvard_official/",1,1,2,2.9926899441097987,0.10199999999999999,0,0,0,0,12.006278465378381,0.64400000000000002,5.0000000000000001E-3,3.0552494461882587,0.55700000000000005,4.0000000000000001E-3,2,0,0,1,0,"https://www.instagram.com/p/CH23rT2FNml/",1,0,1,"https://www.instagram.com/p/CF1J8pBFW_y/",1,10.51,1,"https://www.instagram.com/p/CFZPPzbFuc9/",1,10.88,1,1,2,1,19,11,0.57894736842105265]
["Росгидромет","4503 https://vk.com/roshydromet","2468 https://www.facebook.com/roshydromet/","457 https://ok.ru/rosgidromet.federalnayasluzhba (страница заведена как профиль, а не как группа)","2425 https://www.instagram.com/roshydromet.fs/",3,1,2,0,0.59599999999999997,1.4999999999999999E-2,0,0.214,7.0000000000000001E-3,0,0,0,0,4.8380000000000001,0.125,2,2,0,1,0,"https://vk.com/wall-163435505_5284",1,0.05,1,"https://vk.com/wall-163435505_5170",1,12.99,1,"https://vk.com/wall-163435505_5089",1,10.26,1,1,2,1,19,15,0.78947368421052633]
["Росжелдор",0,0,0,0,0,0,0,0,null,0,0,null,0,0,0,0,0,null,0,0,0,0,0,0,0,0,0,0,0,0,0,0,0,0,0,0,0,0,0,19,0,0]
["Росздравнадзор","965\nhttps://vk.com/roszdravnadzorru","-","-","-",1,1,2,3.1997023530000002,0.26800000000000002,0,0,0,0,0,0,0,0,0,0,2,2,0,0,0,"https://vk.com/wall-184355205_208",0,17.899999999999999,0,"https://vk.com/wall-184355205_161",0,20.78,1,"https://vk.com/wall-184355205_173",0,17.73,0,0,0,0.33333333333333331,19,8.3333333333333339,0.43859649122807021]
["Росимущество","-","3375\nhttps://www.facebook.com/Rosim.ru/","-","3818\nhttps://www.instagram.com/rosim.ru/?igshid=4pp45xp2grv6",1,1,1,0,0,0,4.1018387553041018,0.64900000000000002,1.7000000000000001E-2,0,0,0,6.3480192185658595,2.673,5.7000000000000002E-2,2,2,1,1,2,"https://www.facebook.com/Rosim.ru/posts/1555304378000551",0,14.49,0,"https://www.facebook.com/Rosim.ru/posts/1516662495198073",0,20.78,0,"https://www.facebook.com/Rosim.ru/posts/1469521979912125",0,22.59,0,0,0,0,19,11,0.57894736842105265]
["Роскомнадзор","79 058\nhttps://vk.com/rkn","8998\nhttps://www.facebook.com/roskomnadzor.official","-","-",1,0,2,1.9261798640893846,0.183,8.4000000000000005E-2,2.1469110532192035,0.214,5.1999999999999998E-2,0,0,0,0,0,0,2,2,0,1,0,"https://vk.com/wall-76229642_229748",1,17.73,0,"https://vk.com/wall-76229642_229749",1,17.170000000000002,0,"https://vk.com/wall-76229642_229840",1,14.79,0,1,0,0,19,9,0.47368421052631576]
["Рослесхоз","10 345\nhttps://vk.com/rosleshozrf","4040\nhttps://www.facebook.com/RosleshozRF/","-","9707\nhttps://www.instagram.com/rosleshoz/",1,1,2,1.787601168000424,0.53100000000000003,1.9E-2,6.5356346519118009,0.71699999999999997,2.5999999999999999E-2,0,0,0,4.2900803069220013,1.879,3.5000000000000003E-2,2,2,0,1,0,"https://vk.com/wall-121901344_8855",0,19.53,1,"https://vk.com/wall-121901344_8856",0,17.329999999999998,0,"https://vk.com/wall-121901344_8866",1,14.49,1,0.33333333333333331,0,0.66666666666666663,19,10,0.52631578947368418]
["Росмолодёжь","126 539\nhttps://vk.com/rosmolodez","9108\nhttps://www.facebook.com/rosmolodez","-","52 800\nhttps://www.instagram.com/rosmolodez/",1,1,2,1.8409774448631293,4.4999999999999998E-2,1E-3,0.62942018700000002,0.106,1E-3,0,0,0,1.0362473125728286,0.44900000000000001,7.0000000000000001E-3,2,0,0,1,2,"https://vk.com/wall-49388164_47604",1,12.55,1,"https://vk.com/rosmolodez?w=wall-49388164_48796",1,9.3699999999999992,1,"https://vk.com/wall-49388164_45473",1,16.98,1,1,1,1,19,12,0.63157894736842102]
["Росморречфлот",0,0,"-","4974\nhttps://www.instagram.com/rosmorrechflot_russia/",1,0,2,0,0,0,0,0,0,0,0,0,0,2.3220000000000001,8.0000000000000002E-3,1,0,1,1,0,"https://www.instagram.com/p/CMNAHYmgm0u/",1,15.78,1,"https://www.instagram.com/p/CKV7DZHLxPo/",1,22.76,1,"https://www.instagram.com/p/CIP7GsdghWO//",1,10.47,1,1,0,1,19,8,0.42105263157894735]
["Роснедра","77\nhttps://vk.com/rosnedra.official","146\nhttps://www.facebook.com/rosnedra.official","-","392\nhttps://www.instagram.com/rosnedra.official/",1,1,2,17.096018735362996,1.6160000000000001,0,13.336452971455309,1.119,8.0000000000000002E-3,0,0,0,10.638297872340425,2.5299999999999998,2.1999999999999999E-2,2,1,0,1,1,"https://vk.com/wall-191920100_219",1,3.66,1,"https://vk.com/wall-191920100_233",1,5.64,1,"https://vk.com/wall-191920100_186",1,7.27,1,1,2,1,19,13,0.68421052631578949]
["Рособрнадзор","76 267 https://vk.com/obrnadzorru","12 245 https://www.facebook.com/rosobrnadzor/","-","68,6 тыс https://www.instagram.com/rosobrnadzor/",1,0,2,1.4421757672536182,0.67,2.9000000000000001E-2,1.2523962031401121,0.317,3.0000000000000001E-3,0,0,0,2.9262105003759613,0.51600000000000001,1.9E-2,2,1,1,1,1,"https://vk.com/wall-36510627_29828",1,14.58,1,"https://vk.com/wall-36510627_29808",1,13.56,1,"https://vk.com/wall-36510627_31425",1,15.17,1,1,1,1,19,12,0.63157894736842102]
["Роспатент","255 https://vk.com/rospatent_fips1 (не оценивалась)","4 569 https://www.facebook.com/rospatent/","-","-",1,1,2,0,0,0,0,0.752,4.4999999999999998E-2,0,0,0,0,0,0,2,2,1,1,2,"https://www.facebook.com/1651766101767384/posts/2764805960463387",0,15.59,1,"https://www.facebook.com/1651766101767384/posts/2783487341928582",0,15.36,1,"https://www.facebook.com/1651766101767384/posts/2840994079511241",0,14.3,1,0,1,1,19,14,0.73684210526315785]
["Роспотребнадзор","87 702 https://vk.com/rospotrebnadzor.official","21 081 https://www.facebook.com/rpndzr","41 338 https://ok.ru/rospotrebnadzor.official","1 млн https://www.instagram.com/rospotrebnadzor.official/",2,1,2,0.53658763108372987,0.34100000000000003,5.0999999999999997E-2,0.3,0.36,0.121,0.873570705,0.34100000000000003,5.0999999999999997E-2,1.7362428166716601,0.40500000000000003,9.2999999999999999E-2,2,2,1,1,0,"https://vk.com/wall-193059638_1050",1,9.56,1,"https://vk.com/wall-193059638_3329",1,12.2,1,"https://vk.com/wall-193059638_4247",1,15.83,1,1,1,1,19,14,0.73684210526315785]
["Росприроднадзор","17 568 https://vk.com/rpngov","11 208 https://www.facebook.com/Rosprirodnadzor.official/","6914 https://ok.ru/group/55077981782194","30,7 тыс https://www.instagram.com/rpngov/",2,1,2,0,0.41499999999999998,4.2999999999999997E-2,0,0.30099999999999999,1.2E-2,0,0.151,5.0000000000000001E-3,0,1.46,3.9E-2,2,2,0,1,0,"https://vk.com/wall-178990846_12348",1,9.73,1,"https://vk.com/wall-178990846_12213",1,8.89,1,"https://vk.com/wall-178990846_13516",1,5.84,1,1,2,1,19,14,0.73684210526315785]
["Росреестр","52 220 https://vk.com/rosreestr_ru","4691 https://www.facebook.com/rosreestr.ru","1543 https://ok.ru/rosreestr.ru","11 057 https://www.instagram.com/rosreestr.ru/",1,1,2,1.3880758776174937,0.217,0,2.4391651576691942,0.56100000000000005,1.0720000000000001,7.3449484431350633,1.4999999999999999E-2,0.68400000000000005,4.6225536700000003,1.512,0,2,2,0,1,2,"https://vk.com/wall-46688657_1790",1,15.36,1,"https://vk.com/wall-46688657_1753",1,11.13,1,"https://vk.com/wall-46688657_1672",1,10.26,1,1,2,1,19,15,0.78947368421052633]
["Росрезерв",0,0,0,0,0,0,0,0,0,0,0,0,0,0,0,0,0,0,0,0,0,0,0,0,0,0,0,0,0,0,0,0,0,0,0,0,0,0,0,19,0,0]
["Росрыболовство",0,"1832 https://www.facebook.com/fish.gov.ru?fref=ts",0,"2093 https://www.instagram.com/fish.gov.ru/",1,1,1,0,0,0,0,0.61099999999999999,1.7999999999999999E-2,0,0,0,0,4.056,2.8000000000000001E-2,2,1,0,1,0,"https://www.facebook.com/394922423854955/posts/5607171479296664",0,15.36,1,"https://www.facebook.com/394922423854955/posts/5305883176092164",0,14.03,1,"https://www.facebook.com/394922423854955/posts/5422367074443773",1,11.32,1,0.33333333333333331,1,1,19,9.3333333333333321,0.49122807017543851]
["Россельхознадзор",0,"75 https://www.facebook.com/fsvpsofficial/",0,"805 https://www.instagram.com/fsvps.official/?hl=ru",1,1,2,0,0,0,0,7.4829999999999997,0.13100000000000001,0,0,0,0,3.0270000000000001,7.1999999999999995E-2,2,2,0,1,2,"https://www.facebook.com/109083321017513/posts/163109135614931",0,15.47,1,"https://www.facebook.com/109083321017513/posts/162302159028962",0,20.47,1,"https://www.facebook.com/109083321017513/posts/161665192425992",0,null,1,0,0,1,19,12,0.63157894736842102]
["Россотрудничество","8399\n( https://vk.com/rsgovru )","31 751\n( https://www.facebook.com/rsgov/ )",0,"12,2 тыс\n( https://www.instagram.com/rsgov/ )",1,1,2,0,0.26100000000000001,1.2999999999999999E-2,0,0.378,1.4E-2,0,0,0,0,1.3009999999999999,2.1000000000000001E-2,2,1,1,1,2,"https://www.facebook.com/rsgov/photos/a.420750617960319/3224214814280538/",1,10.62,1,"https://fb.watch/4zW3x531nB/",1,8.89,1,"https://www.facebook.com/rsgov/photos/a.420750617960319/3323489217686430/",1,19.82,1,1,1,1,19,14,0.73684210526315785]
["Росстандарт",0,"1740\n( https://www.facebook.com/rosstandart )",0,"3138\n( https://www.instagram.com/rosstandard/?igshid=1v6h3j2fjyi8u )",1,1,2,0,0,0,0,0.91800000000000004,1.2E-2,0,0,0,0,4.3680000000000003,4.5999999999999999E-2,null,null,0,1,0,"https://www.instagram.com/p/CLwjzwzlDdT/?igshid=1oppu7vat7gwi",1,9.5,1,"https://www.instagram.com/p/CJZA__iFIWh/?igshid=1vthcqhc3ci3s",1,9.6,1,"https://www.instagram.com/p/CJbuiXeFrQY/?igshid=1xvgj2ppn054o",1,12.55,1,1,2,1,19,9,0.47368421052631576]
["Росстат","5888\n( https://vk.com/rosstatistika )","1897\n( https://www.facebook.com/rosstatistika/ )","365\n( https://ok.ru/group/56245432746155 ) страница не ведется с июля 2020",0,1,1,2,3.5306768381756206,1.292,6.8000000000000005E-2,5.0104843073593068,1.821,6.4000000000000001E-2,0,0,0,0,0,0,2,2,1,1,1,"https://vk.com/wall-152641130_3435",1,5.94,1,"https://vk.com/wall-152641130_3562",1,12.55,1,"https://vk.com/wall-152641130_3217",1,8.39,1,1,2,1,19,15,0.78947368421052633]
["Ростехнадзор","435\n( https://vk.com/rostechnadzor )","1275\n( https://www.facebook.com/gosnadzor )",0,0,1,1,2,0,1.909,0.30299999999999999,0,1.466,1.9E-2,0,0,0,0,0,0,2,2,1,1,0,"https://www.facebook.com/gosnadzor/posts/2755502611379547",0,8.7100000000000009,1,"https://www.facebook.com/gosnadzor/posts/2749552515307890",0,18.8,1,"https://www.facebook.com/gosnadzor/photos/a.1422261324703689/2630027553927054/",1,19.04,1,0.33333333333333331,1,1,19,12.333333333333332,0.64912280701754377]
["Ространснадзор",0,"219\n( https://www.facebook.com/Федеральная-служба-по-надзору-в-сфере-транспорта-587410111409306 ) Страница не актвина с 2018 года",0,"913\n( https://www.instagram.com/rostransnadzor.official/ )",1,0,2,0,0,0,0,0,0,0,0,0,0,6.2080000000000002,6.0000000000000001E-3,2,0,0,1,0,"https://www.instagram.com/p/CLeuBfMBlyl/?igshid=1mpsyoqyn72c",0,24.26,0,"https://www.instagram.com/p/CGhbc-DjVsh/?igshid=142mvor7a0ok33",1,16.59,0,"https://www.instagram.com/p/CIm0NpgBizp/?igshid=daprwg2va70h",0,21.16,0,0.33333333333333331,0,0,19,6.333333333333333,0.33333333333333331]
["Роструд","19725\n( https://vk.com/federal_slujba )\n\n","5342\n( https://www.facebook.com/rostrud.info )","https://ok.ru/profile/591585191480 (Страница ведется как профиль, а не как группа)","4061\n( https://www.instagram.com/rostrud.official/?igshid=9jv2w7g8fs28 )",3,1,2,1.2290000000000001,0.254,5.6000000000000001E-2,4.4589999999999996,0.16500000000000001,1.7000000000000001E-2,0,0,0,5.8175999999999997,2.109,0.17899999999999999,2,2,1,2,1,"https://vk.com/wall-72147680_7889",1,7.27,1,"https://vk.com/wall-72147680_7821",0,22.03,1,"https://vk.com/wall-72147680_7737",1,16.59,1,0.66666666666666663,1,1,19,16.666666666666664,0.87719298245614019]
["Ростуризм","10838\n( https://vk.com/rostourism.official )","3478\n( https://www.facebook.com/rostourism.official/ )",0,0,1,1,2,0,0.223,6.3E-2,0,1.855,0.17199999999999999,0,0,0,0,0,0,2,2,1,1,0,"https://vk.com/wall-41862358_8577",0,10.130000000000001,1,"https://vk.com/wall-41862358_8562",0,14.95,1,"https://vk.com/wall-41862358_9434",1,12.64,1,0.33333333333333331,1,1,19,12.333333333333332,0.64912280701754377]
["Росфинмониторинг",0,"91\n( https://www.facebook.com/fedsfm )",0,"600\n( https://www.instagram.com/fedsfm/ )",2,1,2,0,0,0,0,7.8040000000000003,5.1999999999999998E-2,0,0,0,0,4.2990000000000004,4.1000000000000002E-2,2,2,0,1,0,"https://www.instagram.com/p/CJbHaLTlSDu/?igshid=6jr1dt6llhol",0,30.03,0,"https://www.instagram.com/p/CLWkO59lR7z/?igshid=19r07nha24s3v",0,8.73,0,"https://www.instagram.com/p/CHFvX-fDnGr/?igshid=vagpr81fmbeg",0,16.760000000000002,0,0,0,0,19,10,0.52631578947368418]
["СВР России",0,0,0,0,0,0,0,0,0,0,0,0,0,0,0,0,0,0,0,0,0,0,0,0,0,0,0,0,0,0,0,0,0,0,0,0,0,0,0,19,0,0]
["Управление делами Президента Российской Федерации",0,0,0,0,0,0,0,0,0,0,0,0,0,0,0,0,0,0,0,0,0,0,0,0,0,0,0,0,0,0,0,0,0,0,0,0,0,0,0,19,0,0]
["ФАДН России","156 https://vk.com/domnarodovrf","https://www.facebook.com/domnarodovrf/",0,"6 587\nhttps://www.instagram.com/fadn_rossii/",2,1,0,28.793650793650798,"5,963\n",5.6000000000000001E-2,11.685779816513762,3.5950000000000002,5.2999999999999999E-2,0,0,0,40.164028446891486,1.5780000000000001,0,2,2,0,1,1,"https://www.instagram.com/p/CGSFjuLghFx/",0,14.49,1,"https://www.instagram.com/p/CJD-xFfALsA/",0,31.1,1,"https://www.instagram.com/p/CE6shxMggQ2/",1,28.01,1,0.33333333333333331,0,1,19,10.333333333333332,0.54385964912280693]
["ФАС России","23 261\nhttps://vk.com/fasrussia","10 923\nhttps://www.facebook.com/fasrussia/","976\nhttps://ok.ru/fasrussia","30 700\nhttps://www.instagram.com/fasrussia/",3,1,2,3.5494375432274996,0.17699999999999999,2.5999999999999999E-2,1.982262452909167,0.17699999999999999,2.1999999999999999E-2,3.9595619208087616,0.27200000000000002,2.7E-2,4.4729426636410325,0.70799999999999996,0.04,2,2,1,1,2,"https://vk.com/wall-54814053_26926",1,17.73,1,"https://vk.com/wall-54814053_25052",1,10.88,1,"https://vk.com/wall-54814053_25676",1,10.88,1,1,1,1,19,17,0.89473684210526316]
["Федеральная пробирная палата",0,0,0,0,0,0,0,0,0,0,0,0,0,0,0,0,0,0,0,0,0,0,0,0,0,0,0,0,0,0,0,0,0,0,0,0,0,0,0,19,0,0]
["Федеральная служба судебных приставов (ФССП России)","74 825\nhttps://vk.com/news_fssprus_ru","3 302\nhttps://www.facebook.com/fsspinfo","406\nhttps://ok.ru/group/60388814618863",0,1,1,2,0.436,1.7999999999999999E-2,0,3.1509999999999998,0.16900000000000001,"0,009\n",2.2502800000000001,"0,049\n",0,0,0,0,2,0,0,0,0,"https://vk.com/wall-59564564_8675",0,13.21,1,"https://vk.com/wall-59564564_8875",1,14.03,1,"https://vk.com/wall-59564564_8880",1,9.4,1,0.66666666666666663,2,1,19,9.6666666666666661,0.50877192982456132]
["ФМБА России",0,"443\nhttps://www.facebook.com/fmbaofrussia/",0,"7 123\nhttps://www.instagram.com/fmba_of_russia/?igshid=1r7pjyfd8zq9i",1,0,2,0,0,0,0,1.165,2.5999999999999999E-2,0,0,0,0,2.391,1.4999999999999999E-2,1,1,0,1,0,"https://www.instagram.com/p/CLoAhs1ldTF/",1,11.91,1,"https://www.instagram.com/p/CGMxzuxplLf/",1,11.75,0,"https://www.instagram.com/p/CFufxh8JKQp/",1,12.55,1,1,2,0.66666666666666663,19,9.6666666666666661,0.50877192982456132]
["ФНС России","73 359\nhttps://vk.com/nalog__ru","7 232\nhttps://www.facebook.com/nalog.ru/","-","-",1,0,2,0.96908397245981537,0.22600000000000001,0,3.9035541958792899,0.95799999999999996,3.6999999999999998E-2,0,0,0,0,0,0,2,2,0,0,0,"https://vk.com/wall-117654841_3069",0,13.21,1,"https://vk.com/wall-117654841_3071",0,13.08,1,"https://vk.com/wall-117654841_3070",0,13.75,1,0,1,1,19,9,0.47368421052631576]
["ФСБ России",0,0,0,0,0,0,0,0,0,0,0,0,0,0,0,0,0,0,0,0,0,0,0,0,0,0,0,0,0,0,0,0,0,0,0,0,0,0,0,19,0,0]
["ФСВТС России",0,0,0,0,0,0,0,0,0,0,0,0,0,0,0,0,0,0,0,0,0,0,0,0,0,0,0,0,0,0,0,0,0,0,0,0,0,0,0,19,0,0]
["ФСИН России",0,"400  https://www.facebook.com/fsinrussia/",0,"4 736 https://www.instagram.com/fsin.russia/ ",1,1,1,0,0,0,5.1142077287746019,0.27700000000000002,2.8000000000000001E-2,0,0,0,26.335828880000001,"9,677\n",5.782,2,2,0,1,0,"https://www.instagram.com/p/CMt5jIQs97z/",1,12.83,1,"https://www.instagram.com/p/CLrHYGtFENN/",1,14.03,1,"https://www.instagram.com/p/CJYast_lsLs/",1,8.44,1,1,1,1,19,11,0.57894736842105265]
["ФСО России",0,0,0,0,0,0,0,0,0,0,0,0,0,0,0,0,0,0,0,0,0,0,0,0,0,0,0,0,0,0,0,0,0,0,0,0,0,0,0,19,0,0]
["ФСТЭК России",0,0,0,0,0,0,0,0,0,0,0,0,0,0,0,0,0,0,0,0,0,0,0,0,0,0,0,0,0,0,0,0,0,0,0,0,0,0,0,19,0,0]
["ФТС России","2 109 https://vk.com/customs_rus","5 398 https://www.facebook.com/customsrf/",0,"24 500 https://www.instagram.com/customs_rus/",1,1,2,6.9350715746421265,4.3470000000000004,6.9000000000000006E-2,1.3785704397582021,1.679,0.20599999999999999,0,0,0,10.460562210006309,5.3970000000000002,6.5000000000000002E-2,2,2,1,1,2,"https://www.instagram.com/p/CLWBrH4JwAH/",1,19.149999999999999,1,"https://www.instagram.com/p/CGwhIlvp6DQ/",1,18.45,1,"https://www.instagram.com/p/BxPM4vlpm_j/",1,6.06,1,1,1,1,19,15,0.78947368421052633]

{"sheet":"Обществ_советы","index":3,"n_rows":72,"n_cols":38,"rows_kept":72,"cut":false,"hidden":false,"merged":[[0,35,0,37],[0,0,1,0],[0,2,0,6],[0,7,0,14],[0,15,0,17],[0,18,0,23],[0,24,0,26],[0,27,0,34]]}
["Ведомство","Сайт","Доступность и полнота информации о членах ОС",{"$nulls":4},"Доступность и полнота информации о работе ОС",{"$nulls":7},"Доступность коммуникации с членами ОС",null,null,"Степень независимости ОС от ФОИВ",{"$nulls":5},"Степень влияния ОС на деятельность ФОИВ",null,null,"Степень активности ОС",{"$nulls":7},"ИТОГ"]
[null,"Наличие отдельного сайта либо раздела ОС","Перечень лиц, входящих в текущий состав ОС","Указание на организацию, должность лиц, входящих в состав ОС","Краткие биографии всех членов ОС ","Фотографии лиц, входящих в состав ОС","Контактная информация членов ОС","Положение об ОС","Наличие на сайте ведомства отдельной новостной ленты ОС","План предстоящих заседаний ОС","Повестки предстоящих заседаний ОС","Протоколы и решения прошедших заседаний ОС","Проводятся ли трансляции заседаний на сайте ОС или в соцсетях","Наличие видеозаписей заседаний ОС ","Наличие информации о работе предыдущих составов ОС","Текст правового акта, регламентирующий порядок участия в открытых заседаниях ОС","Возможность обращения в ОС через сайт или электронную почту ","Наличие на сайте или в соцсетях открытой дискуссионной площадки","Наличие норм в Положении об ОС о формированиИ части состава ОС из представителей НКО ","Наличие общественных деятелей, представителей НКО в составе ОС","Открытость и понятность процедуры формирования состава в Положении об ОС ","Наличие сообщений в новостных лентах ФОИВ и ОС о начале приема заявок в новый состав ОС","Отсутствие в составе ОС сотрудников подведомственных организаций или зависимых организаций","Сообщения в СМИ о нарушениях в работе ОС, о вмешательстве ФОИВ в работу ОС","Включение руководителя, заместителя руководителя ОС в состав коллегии ФОИВ","Участие руководителя ФОИВ в заседаниях ОС ","Наличие на сайте ОС или ФОИВ реакции на рекомендации ОС","Частота заседаний ОС, проведенных в течение предыдущего года","Использование очных форматов заседаний","Присутствует ли в повестках или в протоколах ОС вопросы, поднятые по инициативе членов ОС","Направляются ли рекомендации ОС в адрес ФОИВ, его руководителя или заместителей","Выражали ли члены ОС позицию по вопросам деятельности ведомства в публичном пространстве","Присутствуют ли на заседаниях общественные организации, не представленные в составе ОС","Присутствуют ли на заседаниях представители СМИ","Наличие ежегодного формата публичной отчетности председателя ОС","Итог","Максимум","Rate"]
["Главное управление специальных программ Президента Российской Федерации (ГУСП)","-","-","-","-","-","-","-","-","-","-","-","-","-","-","-","-","-","-","-","-","-","-","-","-","-","-","-","-","-","-","-","-","-","-","-","-","-"]
["Государственная фельдъегерская служба Российской Федерации (ГФС России)","-","-","-","-","-","-","-","-","-","-","-","-","-","-","-","-","-","-","-","-","-","-","-","-","-","-","-","-","-","-","-","-","-","-","-","-","-"]
["Казначейство России",1,1,2,2,1,1,1,1,0,0,2,0,0,2,1,1,0,1,1,3,0,1,1,0,0,0,2,2,2,1,0,0,0,0,30,55,{"$f":"AJ5/AK5","v":0.54545454545454541}]
["МВД России",2,1,1,1,1,0,1,2,2,1,0,0,0,2,1,0,0,1,1,1,0,1,1,0,2,0,0,0,1,0,1,0,0,1,25,55,{"$f":"AJ6/AK6","v":0.45454545454545453}]
["МИД России","-","-","-","-","-","-","-","-","-","-","-","-","-","-","-","-","-","-","-","-","-","-","-","-","-","-","-","-","-","-","-","-","-","-","-","-","-"]
["Минвостокразвития России",1,1,1,1,1,0,1,1,0,0,2,0,0,2,1,1,0,1,1,3,0,1,1,0,0,0,0,1,0,1,1,0,0,0,23,55,{"$f":"AJ8/AK8","v":0.41818181818181815}]
["Минздрав России",1,1,2,2,1,0,1,0,2,0,2,0,0,1,1,1,0,1,1,3,1,0,1,0,1,0,2,1,1,0,0,0,0,0,27,55,{"$f":"AJ9/AK9","v":0.49090909090909091}]
["Минкультуры России",1,1,1,0,1,1,1,2,0,1,2,0,0,2,1,1,0,1,1,3,0,0,1,1,0,1,2,2,1,1,0,0,0,0,29,55,{"$f":"AJ10/AK10","v":0.52727272727272723}]
["Минобороны России",1,1,2,0,0,0,1,2,2,0,0,0,0,1,1,1,0,0,1,0,0,1,1,0,1,0,0,2,0,0,2,0,0,0,20,55,{"$f":"AJ11/AK11","v":0.36363636363636365}]
["Минобрнауки России",1,1,2,0,1,0,1,2,0,0,0,0,0,2,1,0,0,1,1,3,2,0,1,0,2,0,0,2,0,1,0,0,0,0,24,55,{"$f":"AJ12/AK12","v":0.43636363636363634}]
["Минприроды России",1,1,2,0,1,1,1,2,2,0,2,0,0,2,1,0,0,1,1,3,0,1,1,0,1,1,2,2,2,1,1,1,0,0,34,55,{"$f":"AJ13/AK13","v":0.61818181818181817}]
["Минпромторг России",1,1,2,1,1,0,1,1,0,0,0,0,0,2,1,1,0,1,1,3,0,0,1,0,0,0,0,0,0,0,null,0,0,0,18,55,{"$f":"AJ14/AK14","v":0.32727272727272727}]
["Минпросвещения России",1,1,2,0,1,0,1,2,2,2,2,0,0,2,1,1,0,1,1,3,2,0,1,0,1,0,0,2,2,0,1,0,0,0,32,55,{"$f":"AJ15/AK15","v":0.58181818181818179}]
["Минсельхоз России",1,1,2,0,1,1,1,1,2,0,2,0,0,1,1,1,0,1,1,3,0,1,1,1,0,0,1,2,2,1,0,1,0,0,30,55,{"$f":"AJ16/AK16","v":0.54545454545454541}]
["Минспорт России",2,1,2,0,1,0,1,2,0,1,2,1,1,2,1,1,0,1,1,3,1,0,1,1,0,1,1,2,1,1,1,1,0,0,34,55,{"$f":"AJ17/AK17","v":0.61818181818181817}]
["Минстрой России",2,1,2,1,1,0,1,2,1,2,2,1,1,2,2,1,2,1,1,3,0,1,1,2,2,0,2,2,1,1,2,1,0,1,45,55,{"$f":"AJ18/AK18","v":0.81818181818181823}]
["Минтранс России",1,1,2,1,1,0,1,1,0,1,0,0,0,2,1,1,0,1,1,3,0,1,1,2,0,0,0,2,0,0,1,0,0,0,25,55,{"$f":"AJ19/AK19","v":0.45454545454545453}]
["Минтруд России",1,1,2,2,1,0,1,2,0,0,2,0,0,2,1,1,1,1,1,3,1,1,1,0,1,0,1,2,1,1,0,1,1,0,33,55,{"$f":"AJ20/AK20","v":0.6}]
["Минфин России",1,1,1,0,0,0,1,1,0,1,2,0,0,2,2,0,0,1,1,2,1,1,1,0,0,1,2,0,0,1,0,0,0,0,23,55,{"$f":"AJ21/AK21","v":0.41818181818181815}]
["Минцифры России",1,1,1,0,0,0,1,2,1,0,2,0,0,2,1,1,0,1,1,3,0,1,1,0,0,0,1,2,1,0,0,0,0,0,24,55,{"$f":"AJ22/AK22","v":0.43636363636363634}]
["Минэкономразвития России",2,1,2,0,1,1,1,2,1,1,2,0,0,1,2,1,0,1,1,3,0,0,1,0,0,0,0,0,2,0,0,0,0,0,26,55,{"$f":"AJ23/AK23","v":0.47272727272727272}]
["Минэнерго России",1,1,1,0,1,0,1,2,1,0,2,0,0,2,1,1,0,1,1,3,0,1,1,0,1,0,2,0,1,1,0,0,0,0,26,55,{"$f":"AJ24/AK24","v":0.47272727272727272}]
["Минюст России",1,1,2,0,0,0,1,0,0,0,0,0,0,0,0,1,0,1,1,0,0,1,1,0,0,0,0,0,0,0,0,0,0,0,10,55,{"$f":"AJ25/AK25","v":0.18181818181818182}]
["МЧС России",1,1,0,0,0,0,1,1,2,1,2,0,0,0,1,0,0,0,1,2,0,1,1,0,1,0,2,0,1,1,0,1,0,1,22,55,{"$f":"AJ26/AK26","v":0.4}]
["Росавиация",1,1,1,0,1,0,1,1,2,0,2,0,0,2,1,1,0,1,1,3,0,1,1,0,1,0,1,2,1,1,2,1,0,0,30,55,{"$f":"AJ27/AK27","v":0.54545454545454541}]
["Росавтодор",2,1,2,1,1,1,1,1,0,0,0,0,0,1,2,1,1,1,1,3,1,1,1,0,1,0,0,0,0,0,2,0,0,0,26,55,{"$f":"AJ28/AK28","v":0.47272727272727272}]
["Росаккредитация",1,1,1,0,0,0,1,2,1,0,2,0,0,1,1,1,0,1,1,3,0,1,1,1,2,0,0,2,2,1,0,1,0,0,28,55,{"$f":"AJ29/AK29","v":0.50909090909090904}]
["Росалкогольрегулирование",1,1,1,0,0,0,1,2,0,0,2,0,0,1,1,1,0,1,1,3,0,1,1,0,0,0,1,1,2,1,2,1,0,0,26,55,{"$f":"AJ30/AK30","v":0.47272727272727272}]
["Росархив",1,1,2,0,1,1,1,2,1,2,2,1,1,0,1,1,0,0,0,1,0,1,1,1,1,0,1,2,1,1,0,0,0,1,29,55,{"$f":"AJ31/AK31","v":0.52727272727272723}]
["Росводресурсы",1,1,2,0,1,0,1,1,2,0,0,0,0,2,1,0,0,1,1,3,0,1,1,0,0,0,2,1,2,0,2,1,0,0,27,55,{"$f":"AJ32/AK32","v":0.49090909090909091}]
["Росгвардия","-","-","-","-","-","-","-","-","-","-","-","-","-","-","-","-","-","-","-","-","-","-","-","-","-","-","-","-","-","-","-","-","-","-","-","-","-"]
["Росгидромет",1,1,1,0,0,0,1,2,1,2,2,0,0,1,1,1,0,1,1,3,0,0,1,2,1,1,2,2,2,1,0,1,0,1,33,55,{"$f":"AJ34/AK34","v":0.6}]
["Росжелдор",1,1,2,2,1,0,1,1,0,0,0,0,0,0,1,1,0,1,0,3,0,0,1,2,0,0,0,0,0,0,0,0,0,0,18,55,{"$f":"AJ35/AK35","v":0.32727272727272727}]
["Росздравнадзор",1,1,1,0,0,0,1,0,0,0,0,0,0,2,1,0,0,1,1,3,0,1,1,0,0,0,0,0,0,0,0,0,0,0,14,55,{"$f":"AJ36/AK36","v":0.25454545454545452}]
["Росимущество",1,1,2,1,1,0,1,2,0,0,1,0,0,2,1,1,0,1,1,3,2,0,1,0,0,0,0,0,0,0,0,0,0,0,22,55,{"$f":"AJ37/AK37","v":0.4}]
["Роскомнадзор",1,1,1,0,0,0,1,0,0,0,0,0,0,2,1,1,0,1,1,3,0,1,1,0,0,0,0,0,0,0,0,0,0,0,15,55,{"$f":"AJ38/AK38","v":0.27272727272727271}]
["Рослесхоз",1,1,1,0,0,0,1,1,0,0,2,0,0,2,1,1,0,1,1,3,0,1,0,0,1,0,2,2,2,1,1,1,0,0,27,55,{"$f":"AJ39/AK39","v":0.49090909090909091}]
["Росмолодежь",1,1,1,0,1,1,1,1,0,0,2,0,0,1,1,1,0,1,1,3,0,1,1,0,1,0,0,0,0,0,0,0,0,0,20,55,{"$f":"AJ40/AK40","v":0.36363636363636365}]
["Росморречфлот",1,1,2,0,0,0,1,0,0,1,1,1,0,2,1,0,0,1,1,3,0,1,1,1,0,0,0,0,0,0,0,0,0,0,19,55,{"$f":"AJ41/AK41","v":0.34545454545454546}]
["Роснедра",1,1,1,0,0,0,1,1,0,1,2,0,0,2,1,1,0,1,1,3,0,0,1,0,1,1,0,1,2,1,1,0,0,0,25,55,{"$f":"AJ42/AK42","v":0.45454545454545453}]
["Рособрнадзор",1,1,2,0,0,0,1,0,2,0,0,0,0,0,1,1,0,1,1,3,0,1,1,0,2,0,0,0,0,0,0,0,0,0,18,55,{"$f":"AJ43/AK43","v":0.32727272727272727}]
["Роспатент",1,1,2,2,1,1,1,2,0,2,1,1,1,1,1,1,0,1,1,3,0,1,1,0,2,0,1,2,0,1,0,0,0,0,32,55,{"$f":"AJ44/AK44","v":0.58181818181818179}]
["Роспотребнадзор",1,1,2,0,1,1,1,1,2,1,2,0,0,2,1,0,0,1,1,3,0,1,1,0,0,0,1,2,1,1,0,1,0,0,29,55,{"$f":"AJ45/AK45","v":0.52727272727272723}]
["Росприроднадзор",1,1,1,0,0,0,1,1,0,0,2,0,0,0,1,1,0,1,1,3,0,1,1,0,0,0,0,0,0,1,2,0,0,0,19,55,{"$f":"AJ46/AK46","v":0.34545454545454546}]
["Росреестр",1,1,2,2,1,1,1,0,2,1,2,0,0,2,2,1,0,1,1,3,1,1,1,1,2,0,0,2,1,1,0,0,0,0,34,55,{"$f":"AJ47/AK47","v":0.61818181818181817}]
["Росрезерв","-","-","-","-","-","-","-","-","-","-","-","-","-","-","-","-","-","-","-","-","-","-","-","-","-","-","-","-","-","-","-","-","-","-","-","-","-"]
["Росрыболовство",1,1,2,0,0,0,1,2,2,2,2,0,0,1,1,1,0,1,1,3,2,0,1,0,1,1,2,2,2,1,2,1,0,1,37,55,{"$f":"AJ49/AK49","v":0.67272727272727273}]
["Россельхознадзор",1,1,2,2,1,1,1,2,0,2,2,0,0,2,2,1,0,1,1,3,1,1,1,0,1,1,2,1,1,1,0,1,0,0,36,55,{"$f":"AJ50/AK50","v":0.65454545454545454}]
["Россотрудничество",0,0,0,0,0,0,0,0,0,0,0,0,0,0,0,0,0,0,0,0,0,0,0,0,0,0,0,0,0,0,0,0,0,0,0,55,{"$f":"AJ51/AK51","v":0}]
["Росстандарт",1,1,1,0,0,0,1,1,1,0,2,0,0,0,1,1,0,1,1,3,0,1,1,2,1,0,0,2,2,1,0,1,0,0,26,55,{"$f":"AJ52/AK52","v":0.47272727272727272}]
["Росстат",1,1,2,2,1,1,1,2,2,2,2,0,1,2,1,1,0,1,1,3,2,1,1,0,2,1,2,2,2,1,2,1,1,0,45,55,{"$f":"AJ53/AK53","v":0.81818181818181823}]
["Ростехнадзор",1,1,2,0,1,0,1,1,2,2,2,0,0,0,1,1,0,1,1,3,0,0,1,1,2,1,0,2,0,1,0,1,0,0,29,55,{"$f":"AJ54/AK54","v":0.52727272727272723}]
["Ространснадзор",1,1,1,0,0,0,1,0,0,2,1,0,0,2,1,1,0,1,1,3,0,1,1,2,0,0,1,1,0,0,1,0,0,0,23,55,{"$f":"AJ55/AK55","v":0.41818181818181815}]
["Роструд",1,1,1,2,1,1,1,2,1,1,2,0,0,1,1,1,0,1,1,3,0,1,1,0,2,0,1,2,0,1,0,0,0,1,31,55,{"$f":"AJ56/AK56","v":0.5636363636363636}]
["Ростуризм",2,1,1,1,1,0,1,1,1,0,0,0,0,2,1,1,0,1,1,3,0,1,1,0,0,0,0,0,0,0,2,0,0,0,22,55,{"$f":"AJ57/AK57","v":0.4}]
["Росфинмониторинг","-","-","-","-","-","-","-","-","-","-","-","-","-","-","-","-","-","-","-","-","-","-","-","-","-","-","-","-","-","-","-","-","-","-","-","-","-"]
["СВР России","-","-","-","-","-","-","-","-","-","-","-","-","-","-","-","-","-","-","-","-","-","-","-","-","-","-","-","-","-","-","-","-","-","-","-","-","-"]
["Управление делами Президента Российской Федерации",1,1,2,0,0,0,1,0,0,0,1,0,0,0,1,0,0,1,1,1,0,1,1,0,0,0,0,0,0,0,0,0,0,0,12,55,{"$f":"AJ60/AK60","v":0.21818181818181817}]
["ФАДН России",1,1,1,0,0,0,1,0,0,0,1,0,0,0,1,0,0,1,0,3,0,1,1,0,0,0,0,0,0,0,0,0,0,0,12,55,{"$f":"AJ61/AK61","v":0.21818181818181817}]
["ФАС России",2,1,1,0,1,1,1,2,0,1,2,0,0,2,1,1,0,1,1,3,2,1,1,0,0,0,0,0,0,1,0,1,0,0,27,55,{"$f":"AJ62/AK62","v":0.49090909090909091}]
["Федеральная пробирная палата",0,0,0,0,0,0,0,0,0,0,0,0,0,0,0,0,0,0,0,0,1,0,0,0,0,0,0,0,0,0,0,0,0,0,1,55,{"$f":"AJ63/AK63","v":1.8181818181818181E-2}]
["ФМБА России",1,1,1,0,0,0,1,1,0,0,1,0,0,0,1,1,0,1,1,3,0,1,1,1,2,0,0,0,0,0,0,0,0,0,18,55,{"$f":"AJ64/AK64","v":0.32727272727272727}]
["ФНС России",1,1,2,2,1,0,1,1,1,0,2,0,0,2,1,1,0,1,1,3,1,1,1,1,1,0,1,1,1,1,1,1,0,0,32,55,{"$f":"AJ65/AK65","v":0.58181818181818179}]
["ФСБ России","-","-","-","-","-","-","-","-","-","-","-","-","-","-","-","-","-","-","-","-","-","-","-","-","-","-","-","-","-","-","-","-","-","-","-","-","-"]
["ФСВТС России","-","-","-","-","-","-","-","-","-","-","-","-","-","-","-","-","-","-","-","-","-","-","-","-","-","-","-","-","-","-","-","-","-","-","-","-","-"]
["ФСИН России",1,1,2,0,0,0,1,2,0,0,1,0,0,2,0,1,0,1,1,2,0,0,0,0,2,0,0,0,0,1,1,0,1,1,21,55,{"$f":"AJ68/AK68","v":0.38181818181818183}]
["ФСО России","-","-","-","-","-","-","-","-","-","-","-","-","-","-","-","-","-","-","-","-","-","-","-","-","-","-","-","-","-","-","-","-","-","-","-","-","-"]
["ФССП России",2,1,2,0,1,1,1,1,1,1,2,0,0,2,1,0,0,1,1,0,0,1,1,2,2,0,0,0,1,1,0,0,0,1,27,55,{"$f":"AJ70/AK70","v":0.49090909090909091}]
["ФСТЭК России","-","-","-","-","-","-","-","-","-","-","-","-","-","-","-","-","-","-","-","-","-","-","-","-","-","-","-","-","-","-","-","-","-","-","-","-","-"]
["ФТС России",1,1,2,0,0,0,1,1,1,0,0,0,0,1,1,0,0,1,1,3,0,1,1,0,2,0,0,0,0,1,0,1,0,0,20,55,{"$f":"AJ72/AK72","v":0.36363636363636365}]