{"text_format":"2","workbook":"xlsx","n_sheets":5,"sheets":["Рейтинг_ОИ","Коды","Откр_сайтов","Реакц_запрос_8ФЗ","Журн_запрос"],"not_rendered":{"charts":0,"images":0,"macros":0,"external_links":1,"defined_names":4,"comments":0,"pivot_tables":0},"unopened":[],"bounds":{"document_bytes":16777216,"sheet_cells":100000,"run_cost":"one","rows_first":2000,"rows_last":500,"rows_between":2000,"halvings":0,"cell_chars":16384,"cell_head_chars":4096},"cells_cut":0,"cells_raw":0,"read":"whole","date_system":"1900"}

{"sheet":"Рейтинг_ОИ","index":0,"n_rows":71,"n_cols":7,"rows_kept":71,"cut":false,"hidden":false,"merged":[]}
["Ведомство","Статус","Сайты","Запросы","Журналисты","Average","Индекс"]
["Главное управление специальных программ Президента Российской Федерации (ГУСП)","През",0.54761904761904767,0.625,0.5,{"$f":"AVERAGE(C2:E2)","v":0.55753968253968256},{"$f":"IF(F2>=0.7,\"A\",IF(F2>=0.4,\"B\",\"C\"))","v":"B"}]
["Государственная фельдъегерская служба Российской Федерации (ГФС России)","През",0.79545454545454541,0.875,0,{"$f":"AVERAGE(C3:E3)","v":0.55681818181818177},{"$f":"IF(F3>=0.7,\"A\",IF(F3>=0.4,\"B\",\"C\"))","v":"B"}]
["Казначейство России","Прав",0.90909090909090906,0.875,0.45,{"$f":"AVERAGE(C4:E4)","v":0.74469696969696975},{"$f":"IF(F4>=0.7,\"A\",IF(F4>=0.4,\"B\",\"C\"))","v":"A"}]
["МВД России","През",0.91666666666666663,0.375,0.35,{"$f":"AVERAGE(C5:E5)","v":0.54722222222222217},{"$f":"IF(F5>=0.7,\"A\",IF(F5>=0.4,\"B\",\"C\"))","v":"B"}]
["МИД России","През",0.86956521739130432,0.625,0.2,{"$f":"AVERAGE(C6:E6)","v":0.56485507246376809},{"$f":"IF(F6>=0.7,\"A\",IF(F6>=0.4,\"B\",\"C\"))","v":"B"}]
["Минвостокразвития России","Прав",0.95454545454545459,0.75,0.1,{"$f":"AVERAGE(C7:E7)","v":0.60151515151515156},{"$f":"IF(F7>=0.7,\"A\",IF(F7>=0.4,\"B\",\"C\"))","v":"B"}]
["Минздрав России","Прав",0.90909090909090906,0.875,0.55000000000000004,{"$f":"AVERAGE(C8:E8)","v":0.77803030303030296},{"$f":"IF(F8>=0.7,\"A\",IF(F8>=0.4,\"B\",\"C\"))","v":"A"}]
["Минкультуры России","Прав",0.86956521739130432,0.625,0.6,{"$f":"AVERAGE(C9:E9)","v":0.6981884057971014},{"$f":"IF(F9>=0.7,\"A\",IF(F9>=0.4,\"B\",\"C\"))","v":"B"}]
["Минобороны России","През",0.95833333333333337,0,0.15,{"$f":"AVERAGE(C10:E10)","v":0.36944444444444446},{"$f":"IF(F10>=0.7,\"A\",IF(F10>=0.4,\"B\",\"C\"))","v":"C"}]
["Минобрнауки России","Прав",0.81818181818181823,0.625,0.1,{"$f":"AVERAGE(C11:E11)","v":0.51439393939393951},{"$f":"IF(F11>=0.7,\"A\",IF(F11>=0.4,\"B\",\"C\"))","v":"B"}]
["Минприроды России","Прав",0.82608695652173914,0.875,0.1,{"$f":"AVERAGE(C12:E12)","v":0.60036231884057978},{"$f":"IF(F12>=0.7,\"A\",IF(F12>=0.4,\"B\",\"C\"))","v":"B"}]
["Минпромторг России","Прав",0.77272727272727271,0.625,0.15,{"$f":"AVERAGE(C13:E13)","v":0.51590909090909087},{"$f":"IF(F13>=0.7,\"A\",IF(F13>=0.4,\"B\",\"C\"))","v":"B"}]
["Минпросвещения России","Прав",0.95833333333333337,0.875,0.35,{"$f":"AVERAGE(C14:E14)","v":0.72777777777777786},{"$f":"IF(F14>=0.7,\"A\",IF(F14>=0.4,\"B\",\"C\"))","v":"A"}]
["Минсельхоз России","Прав",1,0.875,0.35,{"$f":"AVERAGE(C15:E15)","v":0.7416666666666667},{"$f":"IF(F15>=0.7,\"A\",IF(F15>=0.4,\"B\",\"C\"))","v":"A"}]
["Минспорт России","Прав",0.95652173913043481,0.625,0.7,{"$f":"AVERAGE(C16:E16)","v":0.76050724637681155},{"$f":"IF(F16>=0.7,\"A\",IF(F16>=0.4,\"B\",\"C\"))","v":"A"}]
["Минстрой России","Прав",0.81818181818181823,0.75,0.35,{"$f":"AVERAGE(C17:E17)","v":0.63939393939393951},{"$f":"IF(F17>=0.7,\"A\",IF(F17>=0.4,\"B\",\"C\"))","v":"B"}]
["Минтранс России","Прав",0.95652173913043481,0.875,0.1,{"$f":"AVERAGE(C18:E18)","v":0.64384057971014497},{"$f":"IF(F18>=0.7,\"A\",IF(F18>=0.4,\"B\",\"C\"))","v":"B"}]
["Минтруд России","Прав",0.82608695652173914,0.875,0.2,{"$f":"AVERAGE(C19:E19)","v":0.6336956521739131},{"$f":"IF(F19>=0.7,\"A\",IF(F19>=0.4,\"B\",\"C\"))","v":"B"}]
["Минфин России","Прав",0.90909090909090906,0.75,0.45,{"$f":"AVERAGE(C20:E20)","v":0.70303030303030312},{"$f":"IF(F20>=0.7,\"A\",IF(F20>=0.4,\"B\",\"C\"))","v":"A"}]
["Минцифры России","Прав",1,0.75,0.6,{"$f":"AVERAGE(C21:E21)","v":0.78333333333333333},{"$f":"IF(F21>=0.7,\"A\",IF(F21>=0.4,\"B\",\"C\"))","v":"A"}]
["Минэкономразвития России","Прав",0.93478260869565222,0.75,0.4,{"$f":"AVERAGE(C22:E22)","v":0.69492753623188408},{"$f":"IF(F22>=0.7,\"A\",IF(F22>=0.4,\"B\",\"C\"))","v":"B"}]
["Минэнерго России","Прав",0.86956521739130432,0.75,0.45,{"$f":"AVERAGE(C23:E23)","v":0.68985507246376809},{"$f":"IF(F23>=0.7,\"A\",IF(F23>=0.4,\"B\",\"C\"))","v":"B"}]
["Минюст России","През",0.86956521739130432,0.75,0.65,{"$f":"AVERAGE(C24:E24)","v":0.75652173913043474},{"$f":"IF(F24>=0.7,\"A\",IF(F24>=0.4,\"B\",\"C\"))","v":"A"}]
["МЧС России","През",0.83333333333333337,0.875,0.6,{"$f":"AVERAGE(C25:E25)","v":0.76944444444444449},{"$f":"IF(F25>=0.7,\"A\",IF(F25>=0.4,\"B\",\"C\"))","v":"A"}]
["Росавиация","Прав",0.875,0.625,0.3,{"$f":"AVERAGE(C26:E26)","v":0.6},{"$f":"IF(F26>=0.7,\"A\",IF(F26>=0.4,\"B\",\"C\"))","v":"B"}]
["Росавтодор","Прав",0.95454545454545459,0.75,0.5,{"$f":"AVERAGE(C27:E27)","v":0.73484848484848486},{"$f":"IF(F27>=0.7,\"A\",IF(F27>=0.4,\"B\",\"C\"))","v":"A"}]
["Росаккредитация","Прав",0.77083333333333337,0.5,0.7,{"$f":"AVERAGE(C28:E28)","v":0.65694444444444444},{"$f":"IF(F28>=0.7,\"A\",IF(F28>=0.4,\"B\",\"C\"))","v":"B"}]
["Росалкогольрегулирование","Прав",0.8125,1,0.7,{"$f":"AVERAGE(C29:E29)","v":0.83750000000000002},{"$f":"IF(F29>=0.7,\"A\",IF(F29>=0.4,\"B\",\"C\"))","v":"A"}]
["Росархив","През",1,0.875,0.5,{"$f":"AVERAGE(C30:E30)","v":0.79166666666666663},{"$f":"IF(F30>=0.7,\"A\",IF(F30>=0.4,\"B\",\"C\"))","v":"A"}]
["Росводресурсы","Прав",0.95652173913043481,0.625,0.45,{"$f":"AVERAGE(C31:E31)","v":0.67717391304347829},{"$f":"IF(F31>=0.7,\"A\",IF(F31>=0.4,\"B\",\"C\"))","v":"B"}]
["Росгвардия","През",0.84782608695652173,0.625,0.35,{"$f":"AVERAGE(C32:E32)","v":0.6076086956521739},{"$f":"IF(F32>=0.7,\"A\",IF(F32>=0.4,\"B\",\"C\"))","v":"B"}]
["Росгидромет","Прав",1,0.625,0.6,{"$f":"AVERAGE(C33:E33)","v":0.7416666666666667},{"$f":"IF(F33>=0.7,\"A\",IF(F33>=0.4,\"B\",\"C\"))","v":"A"}]
["Росжелдор","Прав",0.95652173913043481,0,0.3,{"$f":"AVERAGE(C34:E34)","v":0.41884057971014493},{"$f":"IF(F34>=0.7,\"A\",IF(F34>=0.4,\"B\",\"C\"))","v":"B"}]
["Росздравнадзор","Прав",0.89583333333333337,0.75,0.2,{"$f":"AVERAGE(C35:E35)","v":0.61527777777777781},{"$f":"IF(F35>=0.7,\"A\",IF(F35>=0.4,\"B\",\"C\"))","v":"B"}]
["Росимущество","Прав",0.91304347826086951,0.75,0.4,{"$f":"AVERAGE(C36:E36)","v":0.68768115942028984},{"$f":"IF(F36>=0.7,\"A\",IF(F36>=0.4,\"B\",\"C\"))","v":"B"}]
["Роскомнадзор","Прав",0.95833333333333337,0.75,0.35,{"$f":"AVERAGE(C37:E37)","v":0.68611111111111123},{"$f":"IF(F37>=0.7,\"A\",IF(F37>=0.4,\"B\",\"C\"))","v":"B"}]
["Рослесхоз","Прав",0.83333333333333337,0.75,0.3,{"$f":"AVERAGE(C38:E38)","v":0.62777777777777788},{"$f":"IF(F38>=0.7,\"A\",IF(F38>=0.4,\"B\",\"C\"))","v":"B"}]
["Росмолодёжь","Прав",0.86363636363636365,0.75,0.7,{"$f":"AVERAGE(C39:E39)","v":0.77121212121212113},{"$f":"IF(F39>=0.7,\"A\",IF(F39>=0.4,\"B\",\"C\"))","v":"A"}]
["Росморречфлот","Прав",1,0,0.15,{"$f":"AVERAGE(C40:E40)","v":0.3833333333333333},{"$f":"IF(F40>=0.7,\"A\",IF(F40>=0.4,\"B\",\"C\"))","v":"C"}]
["Роснедра","Прав",0.89130434782608692,0.875,0.1,{"$f":"AVERAGE(C41:E41)","v":0.62210144927536237},{"$f":"IF(F41>=0.7,\"A\",IF(F41>=0.4,\"B\",\"C\"))","v":"B"}]
["Рособрнадзор","Прав",0.91304347826086951,0.875,0.4,{"$f":"AVERAGE(C42:E42)","v":0.72934782608695647},{"$f":"IF(F42>=0.7,\"A\",IF(F42>=0.4,\"B\",\"C\"))","v":"A"}]
["Роспатент","Прав",0.95652173913043481,0,0.15,{"$f":"AVERAGE(C43:E43)","v":0.36884057971014489},{"$f":"IF(F43>=0.7,\"A\",IF(F43>=0.4,\"B\",\"C\"))","v":"C"}]
["Роспотребнадзор","Прав",0.9375,0.875,0.1,{"$f":"AVERAGE(C44:E44)","v":0.63750000000000007},{"$f":"IF(F44>=0.7,\"A\",IF(F44>=0.4,\"B\",\"C\"))","v":"B"}]
["Росприроднадзор","Прав",0.91666666666666663,0.75,0.1,{"$f":"AVERAGE(C45:E45)","v":0.58888888888888891},{"$f":"IF(F45>=0.7,\"A\",IF(F45>=0.4,\"B\",\"C\"))","v":"B"}]
["Росреестр","Прав",0.95833333333333337,0.75,0.55000000000000004,{"$f":"AVERAGE(C46:E46)","v":0.75277777777777788},{"$f":"IF(F46>=0.7,\"A\",IF(F46>=0.4,\"B\",\"C\"))","v":"A"}]
["Росрезерв","Прав",0.90909090909090906,0.875,0.4,{"$f":"AVERAGE(C47:E47)","v":0.72803030303030303},{"$f":"IF(F47>=0.7,\"A\",IF(F47>=0.4,\"B\",\"C\"))","v":"A"}]
["Росрыболовство","Прав",0.85416666666666663,0.875,0.25,{"$f":"AVERAGE(C48:E48)","v":0.65972222222222221},{"$f":"IF(F48>=0.7,\"A\",IF(F48>=0.4,\"B\",\"C\"))","v":"B"}]
["Россельхознадзор","Прав",0.8125,0.875,0.7,{"$f":"AVERAGE(C49:E49)","v":0.79583333333333339},{"$f":"IF(F49>=0.7,\"A\",IF(F49>=0.4,\"B\",\"C\"))","v":"A"}]
["Россотрудничество","През",0.86363636363636365,0.75,0.3,{"$f":"AVERAGE(C50:E50)","v":0.63787878787878793},{"$f":"IF(F50>=0.7,\"A\",IF(F50>=0.4,\"B\",\"C\"))","v":"B"}]
["Росстандарт","Прав",0.95833333333333337,0.375,0.2,{"$f":"AVERAGE(C51:E51)","v":0.51111111111111118},{"$f":"IF(F51>=0.7,\"A\",IF(F51>=0.4,\"B\",\"C\"))","v":"B"}]
["Росстат","Прав",1,0.875,0.75,{"$f":"AVERAGE(C52:E52)","v":0.875},{"$f":"IF(F52>=0.7,\"A\",IF(F52>=0.4,\"B\",\"C\"))","v":"A"}]
["Ростехнадзор","Прав",0.91666666666666663,0.75,0.45,{"$f":"AVERAGE(C53:E53)","v":0.7055555555555556},{"$f":"IF(F53>=0.7,\"A\",IF(F53>=0.4,\"B\",\"C\"))","v":"A"}]
["Ространснадзор","Прав",0.95833333333333337,0.625,0.5,{"$f":"AVERAGE(C54:E54)","v":0.69444444444444453},{"$f":"IF(F54>=0.7,\"A\",IF(F54>=0.4,\"B\",\"C\"))","v":"B"}]
["Роструд","Прав",0.91666666666666663,0.625,0.5,{"$f":"AVERAGE(C55:E55)","v":0.68055555555555547},{"$f":"IF(F55>=0.7,\"A\",IF(F55>=0.4,\"B\",\"C\"))","v":"B"}]
["Ростуризм","Прав",0.95454545454545459,0,0.1,{"$f":"AVERAGE(C56:E56)","v":0.35151515151515156},{"$f":"IF(F56>=0.7,\"A\",IF(F56>=0.4,\"B\",\"C\"))","v":"C"}]
["Росфинмониторинг","През",0.71739130434782605,0.75,0.45,{"$f":"AVERAGE(C57:E57)","v":0.63913043478260867},{"$f":"IF(F57>=0.7,\"A\",IF(F57>=0.4,\"B\",\"C\"))","v":"B"}]
["СВР России","През",0.68181818181818177,0,0.25,{"$f":"AVERAGE(C58:E58)","v":0.31060606060606061},{"$f":"IF(F58>=0.7,\"A\",IF(F58>=0.4,\"B\",\"C\"))","v":"C"}]
["Управление делами Президента Российской Федерации","През",0.90476190476190477,0,0.15,{"$f":"AVERAGE(C59:E59)","v":0.35158730158730161},{"$f":"IF(F59>=0.7,\"A\",IF(F59>=0.4,\"B\",\"C\"))","v":"C"}]
["ФАДН России","Прав",0.84090909090909094,0.75,0.15,{"$f":"AVERAGE(C60:E60)","v":0.58030303030303021},{"$f":"IF(F60>=0.7,\"A\",IF(F60>=0.4,\"B\",\"C\"))","v":"B"}]
["ФАС России","Прав",0.91666666666666663,0.875,0.75,{"$f":"AVERAGE(C61:E61)","v":0.84722222222222221},{"$f":"IF(F61>=0.7,\"A\",IF(F61>=0.4,\"B\",\"C\"))","v":"A"}]
["Федеральная пробирная палата","Прав",0.63636363636363635,0.875,0.45,{"$f":"AVERAGE(C62:E62)","v":0.6537878787878787},{"$f":"IF(F62>=0.7,\"A\",IF(F62>=0.4,\"B\",\"C\"))","v":"B"}]
["ФМБА России","Прав",0.91666666666666663,0.625,0.3,{"$f":"AVERAGE(C63:E63)","v":0.61388888888888882},{"$f":"IF(F63>=0.7,\"A\",IF(F63>=0.4,\"B\",\"C\"))","v":"B"}]
["ФНС России","Прав",0.91666666666666663,0.75,0.3,{"$f":"AVERAGE(C64:E64)","v":0.65555555555555556},{"$f":"IF(F64>=0.7,\"A\",IF(F64>=0.4,\"B\",\"C\"))","v":"B"}]
["ФСБ России","През",0.76086956521739135,0.5,0.3,{"$f":"AVERAGE(C65:E65)","v":0.52028985507246384},{"$f":"IF(F65>=0.7,\"A\",IF(F65>=0.4,\"B\",\"C\"))","v":"B"}]
["ФСВТС России","През",0.80952380952380953,0.625,0.1,{"$f":"AVERAGE(C66:E66)","v":0.51150793650793658},{"$f":"IF(F66>=0.7,\"A\",IF(F66>=0.4,\"B\",\"C\"))","v":"B"}]
["ФСИН России","През",0.78260869565217395,0,0.1,{"$f":"AVERAGE(C67:E67)","v":0.29420289855072462},{"$f":"IF(F67>=0.7,\"A\",IF(F67>=0.4,\"B\",\"C\"))","v":"C"}]
["ФСО России","През",0.65217391304347827,0.375,0.65,{"$f":"AVERAGE(C68:E68)","v":0.55905797101449284},{"$f":"IF(F68>=0.7,\"A\",IF(F68>=0.4,\"B\",\"C\"))","v":"B"}]
["ФССП России","През",0.95833333333333337,0.75,0.2,{"$f":"AVERAGE(C69:E69)","v":0.63611111111111118},{"$f":"IF(F69>=0.7,\"A\",IF(F69>=0.4,\"B\",\"C\"))","v":"B"}]
["ФСТЭК России","През",0.71739130434782605,0.75,0.3,{"$f":"AVERAGE(C70:E70)","v":0.58913043478260874},{"$f":"IF(F70>=0.7,\"A\",IF(F70>=0.4,\"B\",\"C\"))","v":"B"}]
["ФТС России","Прав",1,0.75,0.75,{"$f":"AVERAGE(C71:E71)","v":0.83333333333333337},{"$f":"IF(F71>=0.7,\"A\",IF(F71>=0.4,\"B\",\"C\"))","v":"A"}]

{"sheet":"Коды","index":1,"n_rows":83,"n_cols":5,"rows_kept":83,"cut":false,"hidden":false,"merged":[[38,0,38,1],[40,0,41,0],[42,0,43,0],[44,0,45,0],[46,0,49,0],[50,0,52,0],[63,0,63,1],[65,0,68,0],[65,1,66,1],[65,3,78,3],[67,1,68,1],[69,0,75,0],[69,1,70,1],[71,1,73,1],[74,1,75,1],[76,0,81,0],[76,1,78,1],[79,1,81,1],[79,3,81,3],[26,0,27,0],[0,0,0,1],[2,0,16,0],[17,0,18,0],[17,4,18,4],[19,0,20,0],[19,4,20,4],[21,4,22,4],[23,4,24,4],[21,0,22,0],[23,0,24,0]]}
["ОЦЕНКА САЙТОВ ФОИВ (МИНИСТЕРСТВ, АГЕНТСТВ, СЛУЖБ, УПРАВЛЕНИЙ)"]
["Блоки оценки","Критерии оценки","Коды критериев","Возможные значения","Максимум"]
["Общая информация о ФОИВ","Наличие контактов пресс-службы","has_press_contacts","1 - да, 0 - нет",1]
[null,"Наличие почтового адреса, по которому можно направлять запросы и обращения","has_snail_mail","1 - да, 0 - нет",1]
[null,"Наличие электронного адреса для запросов и обращений","has_email","1 - да, 0 - нет",1]
[null,"Наличие телефона для справок","has_phone","1 - да, 0 - нет",1]
[null,"Наличие функционала поиска по сайту","has_search","1 - да, 0 - нет",1]
[null,"Наличие возможности определить дату и время размещения информации, а также дату и время последнего изменения информации","has_date_info","1 - да, 0 - нет",1]
[null,"Наличие возможности масштабировать (увеличивать и уменьшать) шрифт","has_font_options","1 - да, 0 - нет",1]
[null,"Наличие информации о структуре государственного органа","has_structure_info","1 - да, 0 - нет",1]
[null,"Наличие сведений о полномочиях государственного органа, задачах и функциях структурных подразделений органа","has_functions_info","1 - да, 0 - нет",1]
[null,"Наличие перечня территориальных органов и представительств государственного органа","has_territory_info","1 - да, 0 - нет",1]
[null,"Наличие перечня подведомственных организаций","has_children_info","1 - да, 0 - нет",1]
[null,"Наличие сведений о руководителях государственного органа","has_board_info","1 - да, 0 - нет",1]
[null,"Наличие информации о работе государственного органа с обращениями","has_requests_info","1 - да, 0 - нет",1]
[null,"Наличие статистической информации о деятельности государственного органа","has_activity_stats","1 - да, 0 - нет",1]
[null,"Наличие на сайте информации об информационных системах, базах и реестрах в ведении госоргана","has_db_info","1 - да, 0 - нет",1]
["Информация о нормотворческой деятельности","Наличие перечня принятых нормативно-правовых актов ФОИВ","has_law_activity_info","1/2 - да, 0 - нет",1]
[null,"Наличие информации о результатах общественного обсуждения проектов НПА (или ссылка на страницу ФОИВ на regulation.gov.ru)","has_discussion_info","1/2 - да, 0 - нет"]
["Информация об участии ФОИВ в программах","Наличие перечня программ, в которых участвует госорган","has_programmes_info","1/2 - да, 0 - нет",1]
[null,"Сроки начала и окончания реализации программы, ожидаемые результаты","has_program_terms_info","1/2 - да, 0 - нет"]
["Информация о результатах проверок, проведенных ФОИВ*","Наличие информации о результатах проверок, проведенных госорганом, его территориальными органами и подведомственными организациями","has_audit_info","1/2 - да, 0 - нет",1]
[null,"Информация о правилах, соблюдение которых является предметом проводимых проверок","has_regulation_info","1/2 - да, 0 - нет"]
["Информация о кадровом обеспечении","Наличие информации о формировании резерва кадров и его составе","has_jobs_info","1/2 - да, 0 - нет",1]
[null,"Наличие контактов, по которым можно получить информацию о замещении вакантных должностей в госоргане","has_jobs_contacts","1/2 - да, 0 - нет"]
["Информация о предоставлении государственных услуг","Наличие перечня предоставляемых госуслуг (или ссылка на страницу ФОИВ на Госуслугах)","has_services_info","1 - да, 0 - нет",1]
["Пользовательский опыт","Сколько времени ушло на сбор этой информации по сайту","search_time","2 - 0-15 минут,\n 1 - 15-30 минут,\n 0 - более 30 минут",2]
[null,"Насколько легко тексты на сайте воспринимаются читателем","readability","2 – выше коридора нормы,\n1 – в пределах нормы,\n0 – ниже коридора нормы",2]
[null,"МАКСИМУМ",null,null,24]
[]
["* - Для ФОИВ, осуществляющих контроль и надзор. http://static.government.ru/media/files/xcAOZszlPnsB9jDDLj5AQoymiX3QIwfs.pdf"]
{"$rows_empty":7}
["ОЦЕНКА РЕАГИРОВАНИЯ НА ИНФОРМАЦИОННЫЕ ЗАПРОСЫ "]
["Критерии","Баллы"]
["Ответ на запрос поступил","1 – да, "]
[null,"0 – нет"]
["Срок ответа соблюден по закону (30 дней)","1 – да,"]
[null,"0 – нет"]
["Сокращенный срок ответа (15 дней и меньше)","1 – да,"]
[null,"0 – нет"]
["Сколько вопросов раскрыто в ответе","3 – все три вопроса,"]
[null,"2 – два из трех,"]
[null,"1 – только один,"]
[null,"0 – ни одного"]
["Читабельность текста ответа на информационный запрос","2 – лучше коридора нормы,"]
[null,"1 – в пределах нормы,"]
[null,"0 – ниже коридора нормы"]
["Максимум",8]
{"$rows_empty":9}
["ОЦЕНКА ФОИВ ПО ВЗАИМОДЕЙСТВИЮ С ЖУРНАЛИСТАМИ "]
["Блоки оценки","Критерии оценки","Возможные значения","Примечания"]
["Доступность контактов","На сайте указаны отдельные контакты пресс-службы/контакты для журналистов","1 – есть отдельные контакты","Все запросы делаются в соответствии с редакционной политикой, СП не вмещивается в текст запросов. Каждая редакция оценивает ФОИВ по всем параметрам самостоятельно. Период оценки 1-31 марта. СП сверяет оценки по представленным текстами запросов и ответов. Из трех оценок формируется средняя, считается отношение средней оценки по трем редакциям к максимальному кол-ву баллов."]
[null,null,"0 – только общие для справок"]
[null,"Персонификация контактов: указано конкретное имя, определена конкретная группа вопросов, указан конкретный номер для связи","1 – есть"]
[null,null,"0 – нет"]
["Процесс взаимодействия","Пришел ли ответ о получении запрос","1 – есть"]
[null,null,"0 – нет"]
[null,"Для связи с журналистом использовались формальные (общая почта, формальные ответы, бланки и тд) или неформальные (мессенджеры, звонки, персональные почты сотрудников)","2 – использовались формальные и неформальные каналы"]
[null,null,"1 – использовались только формальные каналы"]
[null,null,"0 – нет ответа вообще"]
[null,"Ответ/отказ предоставлен в оговоренный/установленный законом срок","1 – да"]
[null,null,"0 – нет"]
["Качество ответа","Обоснованность, глубина и содержательность ответа","Содержательный полный ответ — 2"]
[null,null,"Неполный ответ или обоснованный отказ — 1"]
[null,null,"Формальный ответ/отписка— 0"]
[null,"Читабельность текста","2 - лучше коридора нормы","Оцениватеся машинно, через сервис проверки текстов. \"Коридор нормы\" формируется по итогам общей оценки всех ФОИВ","http://ru.readability.io"]
[null,null,"1 - в пределах нормы",null,"Норма читабельности - 15-18 баллов"]
[null,null,"0 - ниже показателя нормы"]
[null,"Максимум",10]

{"sheet":"Откр_сайтов","index":2,"n_rows":71,"n_cols":31,"rows_kept":71,"cut":false,"hidden":false,"merged":[]}
["Ведомство","Ссылка на сайт","has_press_contacts","has_snail_mail","has_email","has_phone","has_search","has_date_info","has_font_options","has_structure_info","has_functions_info","has_territory_info","has_children_info","has_board_info","has_requests_info","has_activity_stats","has_db_info","has_law_activity_info","has_discussion_info","has_programmes_info","has_program_terms_info","has_audit_info","has_regulation_info","has_jobs_info","has_jobs_contacts","has_services_info","search_time","readability","Итог","Max","Rate"]
["Главное управление специальных программ Президента Российской Федерации (ГУСП)","http://www.gusp.gov.ru/",0,1,1,1,0,0,0,0,1,"-",0,1,1,1,0,0.5,0.5,0,0,"-","-",0,0.5,"-",2,1,11.5,21,0.54800000000000004]
["Государственная фельдъегерская служба Российской Федерации (ГФС России)","https://gfs.gov.ru/",0,1,1,1,1,1,1,1,1,1,1,1,1,0,0,0.5,0.5,0.5,0.5,"-","-",0,0.5,"-",2,1,17.5,22,0.79500000000000004]
["Казначейство России","https://roskazna.gov.ru/",1,1,0,1,1,1,1,1,1,1,1,1,1,1,1,0.5,0.5,0.5,0.5,"-","-",0.5,0.5,"-",2,1,20,22,0.90900000000000003]
["МВД России","http://www.mvd.ru",1,1,0,1,1,1,1,1,1,1,1,1,1,1,1,0.5,0.5,0.5,0.5,0.5,0.5,0.5,0.5,1,2,1,22,24,0.91700000000000004]
["МИД России","http://www.mid.ru/",1,1,0,1,1,1,1,1,1,1,1,1,1,1,0,0.5,0.5,0.5,0.5,"-","-",0.5,0.5,1,2,1,20,23,0.87]
["Минвостокразвития России","https://minvr.gov.ru/",1,1,1,1,1,1,1,1,1,"-",1,1,1,1,1,0.5,0.5,0.5,0.5,"-","-",0.5,0.5,1,2,1,21,22,0.95499999999999996]
["Минздрав России","https://minzdrav.gov.ru/",1,1,1,1,1,1,1,1,1,"-",1,1,1,1,1,0.5,0.5,0.5,0.5,"-","-",0.5,0.5,1,1,1,20,22,0.90900000000000003]
["Минкультуры России","https://culture.gov.ru/",1,1,1,1,1,1,1,1,1,1,1,1,1,1,1,0.5,0.5,0.5,0.5,0.5,0.5,0.5,0.5,1,1,2,23,24,0.95799999999999996]
["Минобороны России","http://mil.ru/",1,1,0,1,1,0,1,1,1,"-",1,1,1,1,1,0.5,0.5,0.5,0.5,"-","-",0.5,0.5,1,1,1,19,22,0.86399999999999999]
["Минобрнауки России","https://www.minobrnauki.gov.ru/",1,1,0,1,1,0,1,1,1,1,1,1,1,1,1,0.5,0.5,0.5,0.5,"-","-",0.5,0.5,1,1,1,19,23,0.82599999999999996]
["Минприроды России","http://www.mnr.gov.ru/",1,1,0,1,1,1,1,1,1,"-",0,1,1,1,0,0.5,0.5,0.5,0.5,"-","-",0.5,0.5,1,0,2,17,22,0.77300000000000002]
["Минпромторг России","http://minpromtorg.gov.ru/",1,1,1,1,1,0,1,1,1,1,1,1,1,1,1,0.5,0.5,0.5,0.5,0.5,0.5,0.5,0.5,1,2,2,23,24,0.95799999999999996]
["Минпросвещения России","https://edu.gov.ru/",1,1,1,1,1,1,1,1,1,"-",1,1,1,1,1,0.5,0.5,0.5,0.5,0.5,0.5,0.5,0.5,1,2,2,23,23,1]
["Минсельхоз России","https://mcx.gov.ru/",1,1,1,1,1,1,1,1,1,"-",1,1,1,1,1,0.5,0.5,0.5,0.5,0.5,0.5,0.5,0.5,1,2,1,22,23,0.95699999999999996]
["Минспорт России","http://www.minsport.gov.ru/",1,1,0,1,1,1,1,1,1,"-",1,1,1,1,0,0.5,0.5,0.5,0.5,"-","-",0.5,0.5,0,1,2,18,22,0.81799999999999995]
["Минстрой России","https://minstroyrf.gov.ru/",1,1,1,1,1,1,1,1,1,"-",1,1,1,1,1,0.5,0.5,0.5,0.5,0.5,0.5,0.5,0.5,1,1,2,22,23,0.95699999999999996]
["Минтранс России","https://mintrans.gov.ru/",1,1,0,1,1,0,1,1,1,0,1,1,1,1,1,0.5,0.5,0.5,0.5,"-","-",0.5,0.5,1,2,1,19,23,0.82599999999999996]
["Минтруд России","https://mintrud.gov.ru/",1,1,0,1,1,1,1,1,1,"-",1,1,1,1,1,0.5,0.5,0.5,0.5,"-","-",0.5,0.5,1,2,1,20,22,0.90900000000000003]
["Минфин России","https://minfin.gov.ru/ru/",1,1,1,1,1,1,1,1,1,"-",1,1,1,1,1,0.5,0.5,0.5,0.5,0.5,0.5,0.5,0.5,1,2,2,23,23,1]
["Минцифры России","https://digital.gov.ru/ru/",1,1,1,1,1,0,1,1,1,"-",1,1,1,1,1,0.5,0.5,0.5,0.5,0.5,0.5,0.5,0.5,1,1,1,20,23,0.87]
["Минэкономразвития России","https://www.economy.gov.ru/",1,1,1,1,1,1,1,1,1,"-",1,1,1,1,1,0.5,0.5,0.5,0.5,0.5,0.5,0,0.5,1,2,1,21.5,23,0.93500000000000005]
["Минэнерго России","https://minenergo.gov.ru/",1,1,1,1,1,0,1,1,1,"-",1,1,1,1,1,0.5,0.5,0.5,0.5,0.5,0.5,0.5,0.5,1,1,1,20,23,0.87]
["Минюст России","https://minjust.gov.ru/ru/",1,1,1,1,1,1,0,1,1,1,1,1,1,1,1,0.5,0.5,0.5,0.5,"-","-",0.5,0.5,1,2,0,20,23,0.87]
["МЧС России","https://www.mchs.gov.ru/",1,1,0,1,1,0,1,1,1,1,1,1,1,1,1,0.5,0.5,0.5,0.5,0.5,0.5,0.5,0.5,1,1,1,20,24,0.83299999999999996]
["Росавиация","https://favt.gov.ru/",1,1,1,1,1,0,1,1,1,1,1,1,1,1,1,0.5,0.5,0.5,0.5,0.5,0.5,0.5,0.5,1,1,1,21,24,0.875]
["Росавтодор","https://rosavtodor.gov.ru/",1,1,1,1,1,1,1,1,1,"-",1,1,1,1,1,0.5,0.5,0.5,0.5,"-","-",0.5,0.5,1,1,2,21,22,0.95499999999999996]
["Росаккредитация","https://fsa.gov.ru/",1,1,1,1,1,0,1,1,1,1,1,1,1,1,1,0.5,0.5,0,0,0.5,0.5,0.5,0,1,1,0,18.5,24,0.77100000000000002]
["Росалкогольрегулирование","https://fsrar.gov.ru/",1,1,0,1,1,0,1,1,1,1,1,1,1,1,1,0.5,0.5,0.5,0,0.5,0.5,0.5,0.5,1,1,1,19.5,24,0.81299999999999994]
["Росархив","https://archives.gov.ru/",1,1,1,1,1,1,1,1,1,"-",1,1,1,1,1,0.5,0.5,0.5,0.5,"-","-",0.5,0.5,1,2,2,22,22,1]
["Росводресурсы","https://voda.gov.ru/",1,1,1,1,1,1,1,1,1,1,1,1,1,1,1,0.5,0.5,0.5,0.5,"-","-",0.5,0.5,1,2,1,22,23,0.95699999999999996]
["Росгвардия","https://www.rosguard.gov.ru/",1,1,0,1,1,0,1,1,1,1,1,1,1,1,1,0.5,0.5,0.5,0.5,"-","-",0,0.5,1,2,1,19.5,23,0.84799999999999998]
["Росгидромет","http://www.meteorf.ru/",1,1,1,1,1,1,1,1,1,1,1,1,1,1,1,0.5,0.5,0.5,0.5,0.5,0.5,0.5,0.5,1,2,2,24,24,1]
["Росжелдор","http://www.rlw.gov.ru/",1,1,1,1,1,1,1,1,1,1,1,1,1,1,1,0.5,0.5,0.5,0.5,"-","-",0.5,0.5,1,2,1,22,23,0.95699999999999996]
["Росздравнадзор","https://roszdravnadzor.gov.ru/",1,1,1,1,1,1,1,1,1,1,1,1,1,1,1,0.5,0.5,0,0.5,0.5,0.5,0.5,0.5,1,1,1,21.5,24,0.89600000000000002]
["Росимущество","https://www.rosim.ru/",1,1,1,1,1,1,1,1,1,1,1,1,1,1,1,0.5,0.5,0.5,0.5,"-","-",0.5,0.5,1,2,0,21,23,0.91300000000000003]
["Роскомнадзор","http://rkn.gov.ru/",1,1,1,1,1,1,1,1,1,1,1,1,1,1,1,0.5,0.5,0.5,0.5,0.5,0.5,0.5,0.5,1,2,1,23,24,0.95799999999999996]
["Рослесхоз","http://rosleshoz.gov.ru/",1,1,0,1,1,0,0,1,1,1,1,1,1,1,1,0.5,0.5,0.5,0.5,0.5,0.5,0.5,0.5,0,2,2,20,24,0.83299999999999996]
["Росмолодёжь","https://fadm.gov.ru/",1,1,1,1,1,0,1,1,1,"-",1,1,1,1,1,0.5,0.5,0.5,0.5,"-","-",0.5,0.5,1,2,0,19,22,0.86399999999999999]
["Росморречфлот","http://morflot.gov.ru/",1,1,1,1,1,1,1,1,1,"-",1,1,1,1,1,0.5,0.5,0.5,0.5,"-","-",0.5,0.5,1,2,2,22,22,1]
["Роснедра","http://www.rosnedra.gov.ru/",0,1,1,1,1,1,0,1,1,1,1,1,1,1,1,0.5,0.5,0.5,0.5,"-","-",0.5,0.5,1,2,1,20,23,0.87]
["Рособрнадзор","http://obrnadzor.gov.ru/",1,1,1,1,1,0,1,1,1,"-",1,1,1,1,1,0.5,0.5,0.5,0.5,0.5,0.5,0.5,0.5,1,2,1,21,23,0.91300000000000003]
["Роспатент","https://rospatent.gov.ru/ru",1,1,1,1,1,1,1,1,1,"-",1,1,1,1,1,0.5,0.5,0.5,0.5,0.5,0.5,0.5,0.5,1,2,1,21,23,0.91300000000000003]
["Роспотребнадзор","https://www.rospotrebnadzor.ru/",1,1,0,1,1,1,1,1,1,1,1,1,1,1,1,0.5,0.5,0.5,0.5,0.5,0.5,0,0.5,1,2,2,22.5,24,0.93799999999999994]
["Росприроднадзор","https://rpn.gov.ru/",1,1,0,1,1,0,1,1,1,1,1,1,1,1,1,0.5,0.5,0.5,0.5,0.5,0.5,0.5,0.5,1,2,2,22,24,0.91700000000000004]
["Росреестр","https://rosreestr.gov.ru/site/",1,1,1,1,1,0,1,1,1,1,1,1,1,1,1,0.5,0.5,0.5,0.5,0.5,0.5,0.5,0.5,1,2,2,23,24,0.95799999999999996]
["Росрезерв","https://rosrezerv.gov.ru/",1,1,1,1,1,1,1,1,1,1,1,1,1,1,0,0.5,0.5,0.5,0.5,"-","-",0.5,0.5,"-",2,1,20,22,0.90900000000000003]
["Росрыболовство","http://www.fish.gov.ru/",1,1,1,1,1,0,1,1,1,1,1,1,1,1,1,0.5,0.5,0.5,0.5,0.5,0.5,0,0.5,1,1,1,20.5,24,0.85399999999999998]
["Россельхознадзор","https://fsvps.gov.ru/",1,1,1,1,1,0,0,1,1,1,1,1,1,1,1,0.5,0.5,0.5,0.5,0.5,0.5,0.5,0.5,1,2,0,19,24,0.79200000000000004]
["Россотрудничество","http://rs.gov.ru/ru",1,1,1,1,1,0,1,1,1,1,0,1,1,1,1,0.5,0.5,0.5,0.5,"-","-",0.5,0.5,"-",2,1,19,22,0.86399999999999999]
["Росстандарт","https://www.gost.ru/portal/gost",1,1,1,1,1,1,1,1,1,1,1,1,1,1,1,0.5,0.5,0.5,0.5,0.5,0.5,0.5,0.5,1,2,1,23,24,0.95799999999999996]
["Росстат","https://rosstat.gov.ru/",1,1,1,1,1,1,1,1,1,1,1,1,1,1,1,0.5,0.5,0.5,0.5,"-","-",0.5,0.5,1,2,2,23,23,1]
["Ростехнадзор","http://www.gosnadzor.ru/",1,1,1,1,1,0,1,1,1,1,1,1,1,1,1,0.5,0.5,0.5,0.5,0.5,0.5,0.5,0.5,1,2,1,22,24,0.91700000000000004]
["Ространснадзор","https://rostransnadzor.gov.ru/",1,1,1,1,1,1,0,1,1,1,1,1,1,1,1,0.5,0.5,0.5,0.5,0.5,0.5,0.5,0.5,1,2,2,23,24,0.95799999999999996]
["Роструд","https://rostrud.gov.ru/",1,1,1,1,1,0,1,1,1,1,1,1,1,1,1,0.5,0.5,0.5,0.5,0.5,0.5,0.5,0.5,1,2,1,22,24,0.91700000000000004]
["Ростуризм","https://tourism.gov.ru/",1,1,1,1,1,1,0,1,1,"-",1,1,1,1,1,0.5,0.5,0.5,0.5,"-","-",0.5,0.5,1,2,2,21,22,0.95499999999999996]
["Росфинмониторинг","http://www.fedsfm.ru/",1,1,0,1,1,0,1,1,1,1,0,1,1,1,1,0.5,0.5,0.5,0,"-","-",0.5,0.5,0,1,1,16.5,23,0.71699999999999997]
["СВР России","http://svr.gov.ru/",1,1,1,1,1,0,1,1,1,"-",0,1,1,0,0,0.5,0.5,0,0,"-","-",0.5,0.5,0,1,2,16,22,0.72699999999999998]
["Управление делами Президента Российской Федерации","https://udprf.ru/",1,1,1,1,1,0,1,1,1,"-",1,1,1,1,0,0.5,0.5,0.5,0.5,"-","-",0.5,0.5,"-",2,2,19,21,0.90500000000000003]
["ФАДН России","http://fadn.gov.ru/",1,1,1,1,1,1,1,1,1,"-",0,1,1,1,1,0.5,0.5,0.5,0.5,"-","-",0.5,0,1,1,1,18.5,22,0.84099999999999997]
["ФАС России","https://fas.gov.ru/",1,1,1,1,1,1,1,1,1,1,1,1,1,1,1,0.5,0.5,0.5,0.5,0.5,0.5,0.5,0.5,1,2,0,22,24,0.91700000000000004]
["Федеральная пробирная палата","https://www.probpalata.ru/",0,1,1,1,0,0,0,1,1,1,0,1,1,1,1,0.5,0.5,0,0,"-","-",0.5,0.5,"-",1,1,14,22,0.63600000000000001]
["ФМБА России","https://fmba.gov.ru/",1,1,1,1,1,0,1,1,1,1,1,1,1,1,1,0.5,0.5,0.5,0.5,0.5,0.5,0.5,0.5,1,1,2,22,24,0.91700000000000004]
["ФНС России","https://www.nalog.ru/rn77/",1,1,0,1,1,1,1,1,1,1,1,1,1,1,1,0.5,0.5,0.5,0.5,0.5,0.5,0.5,0.5,1,1,2,21,24,0.875]
["ФСБ России","http://www.fsb.ru/",1,1,1,1,1,0,1,1,1,1,1,1,1,0,1,0.5,0.5,0,0,"-","-",0.5,0,1,1,1,17.5,23,0.76100000000000001]
["ФСВТС России","http://www.fsvts.gov.ru/",1,1,1,1,1,1,1,1,1,0,0,1,1,1,"-",0.5,0.5,0.5,0.5,"-","-",0.5,0.5,"-",1,1,17,21,0.81]
["ФСИН России","https://fsin.gov.ru/",1,1,0,1,1,1,1,1,1,1,1,1,1,1,1,0.5,0.5,0.5,0.5,"-","-",0.5,0.5,0,1,0,19,23,0.82599999999999996]
["ФСО России","http://www.fso.gov.ru/",1,1,1,1,0,0,0,1,1,0,0,1,1,1,1,0.5,0.5,0,0,"-","-",0.5,0.5,1,1,1,15,23,0.65200000000000002]
["ФССП России","https://fssp.gov.ru/",1,1,1,1,1,1,1,1,1,1,1,1,1,1,1,0.5,0.5,0.5,0.5,0.5,0.5,0.5,0.5,1,2,1,23,24,0.95799999999999996]
["ФСТЭК России","https://fstec.ru/",0,1,1,1,1,1,1,1,1,1,0,1,1,1,1,0.5,0,0.5,0,"-","-",0,0.5,1,1,0,16.5,23,0.71699999999999997]
["ФТС России","https://customs.gov.ru/",1,1,1,1,1,1,1,1,1,1,1,1,1,1,1,0.5,0.5,0.5,0.5,"-","-",0.5,0.5,1,2,2,23,23,1]

{"sheet":"Реакц_запрос_8ФЗ","index":3,"n_rows":71,"n_cols":9,"rows_kept":71,"cut":false,"hidden":false,"merged":[]}
["Ведомство","Ответ на запрос поступил","Срок ответа соблюден по закону (30 дней)","Сокращенный срок ответа (15 дней и меньше)","Сколько вопросов раскрыто в ответе","Читабельность текста ответа","Итог","Max","Rate"]
["Главное управление специальных программ Президента Российской Федерации (ГУСП)",1,1,0,3,0,5,8,0.625]
["Государственная фельдъегерская служба Российской Федерации (ГФС России)",1,1,1,3,1,7,8,0.875]
["Казначейство России",1,1,0,3,2,7,8,0.875]
["МВД России",1,1,0,1,0,3,8,0.375]
["МИД России",1,1,1,0,2,5,8,0.625]
["Минвостокразвития России",1,1,0,3,1,6,8,0.75]
["Минздрав России",1,1,1,3,1,7,8,0.875]
["Минкультуры России",1,1,0,2,1,5,8,0.625]
["Минобороны России",1,0,0,0,0,0,8,0]
["Минобрнауки России",1,1,0,2,1,5,8,0.625]
["Минприроды России",1,1,1,3,1,7,8,0.875]
["Минпромторг России",1,1,0,2,1,5,8,0.625]
["Минпросвещения России",1,1,1,3,1,7,8,0.875]
["Минсельхоз России",1,1,1,3,1,7,8,0.875]
["Минспорт России",1,1,0,1,2,5,8,0.625]
["Минстрой России",1,1,0,3,1,6,8,0.75]
["Минтранс России",1,1,1,3,1,7,8,0.875]
["Минтруд России",1,1,1,3,1,7,8,0.875]
["Минфин России",1,1,0,3,1,6,8,0.75]
["Минцифры России",1,1,0,3,1,6,8,0.75]
["Минэкономразвития России",1,1,0,3,1,6,8,0.75]
["Минэнерго России",1,1,0,3,1,6,8,0.75]
["Минюст России",1,1,0,3,1,6,8,0.75]
["МЧС России",1,1,0,3,2,7,8,0.875]
["Росавиация",1,1,0,2,1,5,8,0.625]
["Росавтодор",1,1,0,3,1,6,8,0.75]
["Росаккредитация",1,1,0,1,1,4,8,0.5]
["Росалкогольрегулирование",1,1,1,3,2,8,8,1]
["Росархив",1,1,1,3,1,7,8,0.875]
["Росводресурсы",1,1,0,2,1,5,8,0.625]
["Росгвардия",1,1,1,1,1,5,8,0.625]
["Росгидромет",1,1,0,3,0,5,8,0.625]
["Росжелдор",0,0,0,0,0,0,8,0]
["Росздравнадзор",1,1,1,2,1,6,8,0.75]
["Росимущество",1,1,0,3,1,6,8,0.75]
["Роскомнадзор",1,1,0,3,1,6,8,0.75]
["Рослесхоз",1,1,0,3,1,6,8,0.75]
["Росмолодёжь",1,1,0,3,1,6,8,0.75]
["Росморречфлот",0,0,0,0,0,0,8,0]
["Роснедра",1,1,1,3,1,7,8,0.875]
["Рособрнадзор",1,1,1,3,1,7,8,0.875]
["Роспатент",0,0,0,0,0,0,8,0]
["Роспотребнадзор",1,1,1,2,2,7,8,0.875]
["Росприроднадзор",1,1,0,3,1,6,8,0.75]
["Росреестр",1,1,0,3,1,6,8,0.75]
["Росрезерв",1,1,1,3,1,7,8,0.875]
["Росрыболовство",1,1,1,3,1,7,8,0.875]
["Россельхознадзор",1,1,1,3,1,7,8,0.875]
["Россотрудничество",1,1,0,3,1,6,8,0.75]
["Росстандарт",1,1,0,1,0,3,8,0.375]
["Росстат",1,1,1,3,1,7,8,0.875]
["Ростехнадзор",1,1,0,3,1,6,8,0.75]
["Ространснадзор",1,1,0,2,1,5,8,0.625]
["Роструд",1,1,0,2,1,5,8,0.625]
["Ростуризм",0,0,0,0,0,0,8,0]
["Росфинмониторинг",1,1,1,2,1,6,8,0.75]
["СВР России",0,0,0,0,0,0,8,0]
["Управление делами Президента Российской Федерации",0,0,0,0,0,0,8,0]
["ФАДН России",1,1,0,3,1,6,8,0.75]
["ФАС России",1,1,1,3,1,7,8,0.875]
["Федеральная пробирная палата",1,1,1,3,1,7,8,0.875]
["ФМБА России",1,0,0,2,2,5,8,0.625]
["ФНС России",1,1,0,3,1,6,8,0.75]
["ФСБ России",1,1,0,1,1,4,8,0.5]
["ФСВТС России",1,1,1,2,0,5,8,0.625]
["ФСИН России",0,0,0,0,0,0,8,0]
["ФСО России",1,1,0,0,1,3,8,0.375]
["ФССП России",1,1,0,3,1,6,8,0.75]
["ФСТЭК России",1,1,1,3,0,6,8,0.75]
["ФТС России",1,1,0,3,1,6,8,0.75]

{"sheet":"Журн_запрос","index":4,"n_rows":72,"n_cols":19,"rows_kept":72,"cut":false,"hidden":false,"merged":[[0,5,0,7],[0,8,0,10],[0,11,0,13],[0,14,0,16],[0,1,0,2],[0,3,0,4]]}
[null,"Доступность контактов 1",null,"Доступность контактов 2",null,"Процесс взаимодействия 1",null,null,"Процесс взаимодействия 2",null,null,"Качество ответа 1",null,null,"Качество ответа 2"]
["Ведомство","Указаны контакты пресс-службы","Контакты персонифицированы","Указаны контакты пресс-службы","Контакты персонифицированы","Сообщение о получении запроса","Использование неформальных каналов","Соблюдены сроки ответа/отказа","Сообщение о получении запроса","Использование неформальных каналов","Соблюдены сроки ответа/отказа","Содержание ответа","Читабельность ответа ИСХ","Читабельность ответа итог","Содержание ответа","Читабельность ответа ИСХ","Читабельность ответа итог","Итог","Rate"]
["Главное управление специальных программ Президента Российской Федерации (ГУСП)",0,0,0,0,0,1,1,1,1,1,1,23.44,0,2,14.49,2,{"$f":"SUM(B3:L3,N3,O3,Q3)","v":10},{"$f":"R3/[1]Коды!$C$20","v":0.5}]
["Государственная фельдъегерская служба Российской Федерации (ГФС России)",0,0,0,0,0,0,0,0,0,0,0,0,0,0,0,0,{"$f":"SUM(B4:L4,N4,O4,Q4)","v":0},{"$f":"R4/[1]Коды!$C$20","v":0}]
["Казначейство России",1,1,1,1,0,0,0,1,1,1,0,0,0,2,26.02,0,{"$f":"SUM(B5:L5,N5,O5,Q5)","v":9},{"$f":"R5/[1]Коды!$C$20","v":0.45}]
["МВД России",1,0,1,0,0,1,1,0,0,0,1,14.29,2,0,0,0,{"$f":"SUM(B6:L6,N6,O6,Q6)","v":7},{"$f":"R6/[1]Коды!$C$20","v":0.35}]
["МИД России",1,1,1,1,0,0,0,0,0,0,0,0,0,0,0,0,{"$f":"SUM(B7:L7,N7,O7,Q7)","v":4},{"$f":"R7/[1]Коды!$C$20","v":0.2}]
["Минвостокразвития России",1,0,1,0,0,0,0,0,0,0,0,0,0,0,0,0,{"$f":"SUM(B8:L8,N8,O8,Q8)","v":2},{"$f":"R8/[1]Коды!$C$20","v":0.1}]
["Минздрав России",1,0,1,0,0,1,1,1,2,1,1,13.62,2,0,0,0,{"$f":"SUM(B9:L9,N9,O9,Q9)","v":11},{"$f":"R9/[1]Коды!$C$20","v":0.55000000000000004}]
["Минкомсвязь России",1,0,1,0,1,2,1,1,0,1,2,14.49,2,0,0,0,{"$f":"SUM(B10:L10,N10,O10,Q10)","v":12},{"$f":"R10/[1]Коды!$C$20","v":0.6}]
["Минкультуры России",1,1,1,0,0,0,0,0,0,0,0,0,0,0,0,0,{"$f":"SUM(B11:L11,N11,O11,Q11)","v":3},{"$f":"R11/[1]Коды!$C$20","v":0.15}]
["Минобороны России",1,0,1,0,0,0,0,0,0,0,0,0,0,0,0,0,{"$f":"SUM(B12:L12,N12,O12,Q12)","v":2},{"$f":"R12/[1]Коды!$C$20","v":0.1}]
["Минобрнауки России",1,0,1,0,0,0,0,0,0,0,0,0,0,0,0,0,{"$f":"SUM(B13:L13,N13,O13,Q13)","v":2},{"$f":"R13/[1]Коды!$C$20","v":0.1}]
["Минприроды России",1,0,1,1,0,0,0,0,0,0,0,0,0,0,0,0,{"$f":"SUM(B14:L14,N14,O14,Q14)","v":3},{"$f":"R14/[1]Коды!$C$20","v":0.15}]
["Минпромторг России",1,0,1,1,0,2,0,0,0,0,2,19.489999999999998,0,0,0,0,{"$f":"SUM(B15:L15,N15,O15,Q15)","v":7},{"$f":"R15/[1]Коды!$C$20","v":0.35}]
["Минпросвещения России",1,0,1,0,0,0,0,1,1,1,0,0,0,2,50.06,0,{"$f":"SUM(B16:L16,N16,O16,Q16)","v":7},{"$f":"R16/[1]Коды!$C$20","v":0.35}]
["Минсельхоз России",1,0,1,1,1,2,1,1,1,1,2,20.59,0,2,18.66,0,{"$f":"SUM(B17:L17,N17,O17,Q17)","v":14},{"$f":"R17/[1]Коды!$C$20","v":0.7}]
["Минспорт России",1,0,1,0,0,0,0,1,0,1,0,0,0,2,16.739999999999998,1,{"$f":"SUM(B18:L18,N18,O18,Q18)","v":7},{"$f":"R18/[1]Коды!$C$20","v":0.35}]
["Минстрой России",1,0,1,0,0,0,0,0,0,0,0,0,0,0,0,0,{"$f":"SUM(B19:L19,N19,O19,Q19)","v":2},{"$f":"R19/[1]Коды!$C$20","v":0.1}]
["Минтранс России",1,1,1,1,0,0,0,0,0,0,0,0,0,0,0,0,{"$f":"SUM(B20:L20,N20,O20,Q20)","v":4},{"$f":"R20/[1]Коды!$C$20","v":0.2}]
["Минтруд России",1,0,1,0,0,2,1,0,0,0,2,14.84,2,0,0,0,{"$f":"SUM(B21:L21,N21,O21,Q21)","v":9},{"$f":"R21/[1]Коды!$C$20","v":0.45}]
["Минфин России",1,0,1,0,0,1,1,1,0,1,2,15.36,1,1,6.96,2,{"$f":"SUM(B22:L22,N22,O22,Q22)","v":12},{"$f":"R22/[1]Коды!$C$20","v":0.6}]
["Минэкономразвития России",1,0,1,1,0,1,1,0,0,0,1,11.75,2,0,0,0,{"$f":"SUM(B23:L23,N23,O23,Q23)","v":8},{"$f":"R23/[1]Коды!$C$20","v":0.4}]
["Минэнерго России",1,1,1,1,0,1,1,0,0,0,1,7.27,2,0,0,0,{"$f":"SUM(B24:L24,N24,O24,Q24)","v":9},{"$f":"R24/[1]Коды!$C$20","v":0.45}]
["Минюст России",1,0,1,0,0,1,1,1,1,1,2,12.55,2,2,26.46,0,{"$f":"SUM(B25:L25,N25,O25,Q25)","v":13},{"$f":"R25/[1]Коды!$C$20","v":0.65}]
["МЧС России",1,1,1,0,0,1,1,0,0,1,2,16.420000000000002,1,1,13.31,2,{"$f":"SUM(B26:L26,N26,O26,Q26)","v":12},{"$f":"R26/[1]Коды!$C$20","v":0.6}]
["Росавиация",1,1,1,1,1,1,0,0,0,0,0,0,0,0,0,0,{"$f":"SUM(B27:L27,N27,O27,Q27)","v":6},{"$f":"R27/[1]Коды!$C$20","v":0.3}]
["Росавтодор",1,0,1,1,1,1,1,1,0,0,2,16.87,1,0,0,0,{"$f":"SUM(B28:L28,N28,O28,Q28)","v":10},{"$f":"R28/[1]Коды!$C$20","v":0.5}]
["Росаккредитация",1,0,1,0,1,2,1,1,0,1,2,15.36,1,2,16.79,1,{"$f":"SUM(B29:L29,N29,O29,Q29)","v":14},{"$f":"R29/[1]Коды!$C$20","v":0.7}]
["Росалкогольрегулирование",1,0,1,0,1,2,1,1,1,1,2,12.16,2,1,19.82,0,{"$f":"SUM(B30:L30,N30,O30,Q30)","v":14},{"$f":"R30/[1]Коды!$C$20","v":0.7}]
["Росархив",1,0,1,1,1,2,1,0,0,0,2,17.45,1,0,0,0,{"$f":"SUM(B31:L31,N31,O31,Q31)","v":10},{"$f":"R31/[1]Коды!$C$20","v":0.5}]
["Росводресурсы",1,1,1,1,0,1,1,0,0,0,2,16.760000000000002,1,0,0,0,{"$f":"SUM(B32:L32,N32,O32,Q32)","v":9},{"$f":"R32/[1]Коды!$C$20","v":0.45}]
["Росгвардия",1,0,1,0,1,2,1,0,0,0,1,21.71,0,0,0,0,{"$f":"SUM(B33:L33,N33,O33,Q33)","v":7},{"$f":"R33/[1]Коды!$C$20","v":0.35}]
["Росгидромет",1,1,1,1,1,2,1,0,0,0,2,13.85,2,0,0,0,{"$f":"SUM(B34:L34,N34,O34,Q34)","v":12},{"$f":"R34/[1]Коды!$C$20","v":0.6}]
["Росжелдор",1,1,1,1,1,1,0,0,0,0,0,0,0,0,0,0,{"$f":"SUM(B35:L35,N35,O35,Q35)","v":6},{"$f":"R35/[1]Коды!$C$20","v":0.3}]
["Росздравнадзор",1,1,1,1,0,0,0,0,0,0,0,0,0,0,0,0,{"$f":"SUM(B36:L36,N36,O36,Q36)","v":4},{"$f":"R36/[1]Коды!$C$20","v":0.2}]
["Росимущество",1,0,1,1,1,2,1,0,0,0,1,20.399999999999999,0,0,0,0,{"$f":"SUM(B37:L37,N37,O37,Q37)","v":8},{"$f":"R37/[1]Коды!$C$20","v":0.4}]
["Роскомнадзор",1,0,1,0,0,0,0,1,1,1,0,0,0,2,21.25,0,{"$f":"SUM(B38:L38,N38,O38,Q38)","v":7},{"$f":"R38/[1]Коды!$C$20","v":0.35}]
["Рослесхоз",1,0,1,0,0,1,1,0,0,0,0,12.55,2,0,0,0,{"$f":"SUM(B39:L39,N39,O39,Q39)","v":6},{"$f":"R39/[1]Коды!$C$20","v":0.3}]
["Росмолодёжь",1,0,1,0,1,2,1,1,1,1,2,16.47,1,2,26.03,0,{"$f":"SUM(B40:L40,N40,O40,Q40)","v":14},{"$f":"R40/[1]Коды!$C$20","v":0.7}]
["Росморречфлот",1,1,1,0,0,0,0,0,0,0,0,0,0,0,0,0,{"$f":"SUM(B41:L41,N41,O41,Q41)","v":3},{"$f":"R41/[1]Коды!$C$20","v":0.15}]
["Роснедра",1,0,1,0,0,0,0,0,0,0,0,0,0,0,0,0,{"$f":"SUM(B42:L42,N42,O42,Q42)","v":2},{"$f":"R42/[1]Коды!$C$20","v":0.1}]
["Рособрнадзор",1,0,1,0,0,1,1,0,0,0,2,11.32,2,0,0,0,{"$f":"SUM(B43:L43,N43,O43,Q43)","v":8},{"$f":"R43/[1]Коды!$C$20","v":0.4}]
["Роспатент",1,0,1,0,0,0,0,1,0,0,0,0,0,0,0,0,{"$f":"SUM(B44:L44,N44,O44,Q44)","v":3},{"$f":"R44/[1]Коды!$C$20","v":0.15}]
["Роспотребнадзор",1,0,1,0,0,0,0,0,0,0,0,0,0,0,0,0,{"$f":"SUM(B45:L45,N45,O45,Q45)","v":2},{"$f":"R45/[1]Коды!$C$20","v":0.1}]
["Росприроднадзор",1,0,1,0,0,0,0,0,0,0,0,0,0,0,0,0,{"$f":"SUM(B46:L46,N46,O46,Q46)","v":2},{"$f":"R46/[1]Коды!$C$20","v":0.1}]
["Росреестр",1,0,1,1,0,1,1,0,0,1,2,17.21,1,2,24.26,0,{"$f":"SUM(B47:L47,N47,O47,Q47)","v":11},{"$f":"R47/[1]Коды!$C$20","v":0.55000000000000004}]
["Росрезерв",1,0,1,0,0,0,0,1,1,1,0,0,0,2,17.73,1,{"$f":"SUM(B48:L48,N48,O48,Q48)","v":8},{"$f":"R48/[1]Коды!$C$20","v":0.4}]
["Росрыболовство",1,0,1,1,1,1,0,0,0,0,0,0,0,0,0,0,{"$f":"SUM(B49:L49,N49,O49,Q49)","v":5},{"$f":"R49/[1]Коды!$C$20","v":0.25}]
["Россельхознадзор",0,0,0,0,1,2,1,1,1,1,2,12.55,2,2,15.03,1,{"$f":"SUM(B50:L50,N50,O50,Q50)","v":14},{"$f":"R50/[1]Коды!$C$20","v":0.7}]
["Россотрудничество",1,0,1,0,0,1,1,0,0,0,2,19.09,0,0,0,0,{"$f":"SUM(B51:L51,N51,O51,Q51)","v":6},{"$f":"R51/[1]Коды!$C$20","v":0.3}]
["Росстандарт",1,1,1,1,0,0,0,0,0,0,0,0,0,0,0,0,{"$f":"SUM(B52:L52,N52,O52,Q52)","v":4},{"$f":"R52/[1]Коды!$C$20","v":0.2}]
["Росстат",1,1,1,1,1,1,1,1,1,1,1,8.89,2,2,19.059999999999999,0,{"$f":"SUM(B53:L53,N53,O53,Q53)","v":15},{"$f":"R53/[1]Коды!$C$20","v":0.75}]
["Ростехнадзор",1,0,1,0,0,1,1,1,0,1,1,10.88,2,0,29.37,0,{"$f":"SUM(B54:L54,N54,O54,Q54)","v":9},{"$f":"R54/[1]Коды!$C$20","v":0.45}]
["Ространснадзор",1,1,1,1,0,0,0,1,2,1,0,0,0,2,19.420000000000002,0,{"$f":"SUM(B55:L55,N55,O55,Q55)","v":10},{"$f":"R55/[1]Коды!$C$20","v":0.5}]
["Роструд",1,1,1,0,1,1,1,0,0,0,2,12.99,2,0,0,0,{"$f":"SUM(B56:L56,N56,O56,Q56)","v":10},{"$f":"R56/[1]Коды!$C$20","v":0.5}]
["Ростуризм",1,0,1,0,0,0,0,0,0,0,0,0,0,0,0,0,{"$f":"SUM(B57:L57,N57,O57,Q57)","v":2},{"$f":"R57/[1]Коды!$C$20","v":0.1}]
["Росфинмониторинг",1,1,1,1,0,1,1,0,0,0,1,13.75,2,0,0,0,{"$f":"SUM(B58:L58,N58,O58,Q58)","v":9},{"$f":"R58/[1]Коды!$C$20","v":0.45}]
["СВР России",1,0,1,0,0,0,1,0,0,0,0,8.89,2,0,0,0,{"$f":"SUM(B59:L59,N59,O59,Q59)","v":5},{"$f":"R59/[1]Коды!$C$20","v":0.25}]
["Управление делами Президента Российской Федерации",1,0,1,1,0,0,0,0,0,0,0,0,0,0,0,0,{"$f":"SUM(B60:L60,N60,O60,Q60)","v":3},{"$f":"R60/[1]Коды!$C$20","v":0.15}]
["ФАДН России",1,0,1,0,0,1,0,0,0,0,0,0,0,0,0,0,{"$f":"SUM(B61:L61,N61,O61,Q61)","v":3},{"$f":"R61/[1]Коды!$C$20","v":0.15}]
["ФАС России",1,1,1,1,1,1,1,1,0,1,1,10.73,2,2,17.73,1,{"$f":"SUM(B62:L62,N62,O62,Q62)","v":15},{"$f":"R62/[1]Коды!$C$20","v":0.75}]
["Федеральная пробирная палата",0,0,0,0,0,0,1,1,1,1,2,16.7,1,0,11.23,2,{"$f":"SUM(B63:L63,N63,O63,Q63)","v":9},{"$f":"R63/[1]Коды!$C$20","v":0.45}]
["ФМБА России",1,0,1,0,0,1,1,0,0,0,1,15.36,1,0,0,0,{"$f":"SUM(B64:L64,N64,O64,Q64)","v":6},{"$f":"R64/[1]Коды!$C$20","v":0.3}]
["ФНС России",1,0,1,1,0,1,1,0,0,0,1,23.44,0,0,0,0,{"$f":"SUM(B65:L65,N65,O65,Q65)","v":6},{"$f":"R65/[1]Коды!$C$20","v":0.3}]
["ФСБ России",1,0,1,0,0,0,0,0,0,0,0,0,0,0,0,0,{"$f":"SUM(B66:L66,N66,O66,Q66)","v":2},{"$f":"R66/[1]Коды!$C$20","v":0.1}]
["ФСВТС России",1,0,1,0,0,0,0,0,0,0,0,0,0,0,0,0,{"$f":"SUM(B67:L67,N67,O67,Q67)","v":2},{"$f":"R67/[1]Коды!$C$20","v":0.1}]
["ФСИН России",1,0,1,0,0,2,1,1,1,1,2,20.53,0,2,16.82,1,{"$f":"SUM(B68:L68,N68,O68,Q68)","v":13},{"$f":"R68/[1]Коды!$C$20","v":0.65}]
["ФСО России",1,1,1,1,0,0,0,0,0,0,0,0,0,0,0,0,{"$f":"SUM(B69:L69,N69,O69,Q69)","v":4},{"$f":"R69/[1]Коды!$C$20","v":0.2}]
["ФССП России",1,0,1,1,0,1,1,0,0,0,1,20.47,0,0,0,0,{"$f":"SUM(B70:L70,N70,O70,Q70)","v":6},{"$f":"R70/[1]Коды!$C$20","v":0.3}]
["ФСТЭК России",0,0,0,0,1,0,1,0,0,0,2,14.03,2,0,0,0,{"$f":"SUM(B71:L71,N71,O71,Q71)","v":6},{"$f":"R71/[1]Коды!$C$20","v":0.3}]
["ФТС России",1,1,1,0,0,2,1,1,1,1,2,17.73,1,2,18.010000000000002,1,{"$f":"SUM(B72:L72,N72,O72,Q72)","v":15},{"$f":"R72/[1]Коды!$C$20","v":0.75}]