{"text_format":"2","workbook":"xlsx","n_sheets":6,"sheets":["Рейтинг министерства","Рейтинг служб","ОС Министерства","СС Министерства","ОС Службы","СС Службы"],"not_rendered":{"charts":0,"images":0,"macros":0,"external_links":1,"defined_names":1,"comments":2,"pivot_tables":0},"unopened":[],"bounds":{"document_bytes":16777216,"sheet_cells":100000,"run_cost":"one","rows_first":2000,"rows_last":500,"rows_between":2000,"halvings":0,"cell_chars":16384,"cell_head_chars":4096},"cells_cut":0,"cells_raw":0,"read":"whole","date_system":"1900"}

{"sheet":"Рейтинг министерства","index":0,"n_rows":22,"n_cols":6,"rows_kept":22,"cut":false,"hidden":false,"merged":[]}
["Ведомство","Советы","Соцсети","Индекс OC","Индекс СС","Индекс"]
["МВД России",0.58490566037735847,0.6470588235294118,{"$f":"IF(B2>=0.7,\"A\",IF(B2>0.4,\"B\",\"C\"))","v":"B"},{"$f":"IF(C2>=0.7,\"A\",IF(C2>0.4,\"B\",\"C\"))","v":"B"},{"$f":"IF(AND(D2=\"A\",E2=\"A\"),\"A\",IF(OR(D2=\"C\",E2=\"C\"),\"C\",\"B\"))","v":"B"}]
["МИД России",0,0.41176470588235292,{"$f":"IF(B3>=0.7,\"A\",IF(B3>0.4,\"B\",\"C\"))","v":"C"},{"$f":"IF(C3>=0.7,\"A\",IF(C3>0.4,\"B\",\"C\"))","v":"B"},{"$f":"IF(AND(D3=\"A\",E3=\"A\"),\"A\",IF(OR(D3=\"C\",E3=\"C\"),\"C\",\"B\"))","v":"C"}]
["Минвостокразвития России",0.13207547169811318,0.52941176470588236,"C","B","C"]
["Минздрав России",0.45283018867924529,0.41176470588235292,"B","B","B"]
["Минкомсвязь России",9.4339622641509413E-2,0.47058823529411764,"C","B","C"]
["Минкультуры России",0.69811320754716977,0.76470588235294112,"B","A","B"]
["Минобороны России",0.16981132075471697,0.70588235294117652,"C","A","C"]
["Минобрнауки России",0.47169811320754718,0.70588235294117652,"B","A","B"]
["Минприроды России",0.50943396226415094,0.35294117647058826,"B","C","C"]
["Минпромторг России",0.24528301886792453,0.52941176470588236,"C","B","C"]
["Минпросвещения России",0.20754716981132076,0.58823529411764708,"C","B","C"]
["Минсельхоз России",0.16981132075471697,0.6470588235294118,"C","B","C"]
["Минспорт России",0.69811320754716977,0.58823529411764708,"B","B","B"]
["Минстрой России",0.71698113207547165,0.6470588235294118,"A","B","B"]
["Минтранс России",0.47169811320754718,0.47058823529411764,"B","B","B"]
["Минтруд России",0.54716981132075471,5.8823529411764705E-2,"B","C","C"]
["Минфин России",0.52830188679245282,0.47058823529411764,"B","B","B"]
["Минэкономразвития России",0.37735849056603776,0.52941176470588236,"C","B","C"]
["Минэнерго России",0.45283018867924529,0.52941176470588236,"B","B","B"]
["Минюст России",0.13207547169811321,0,"C","C","C"]
["МЧС России",0.35849056603773582,0.6470588235294118,"C","B","C"]

{"sheet":"Рейтинг служб","index":1,"n_rows":52,"n_cols":6,"rows_kept":52,"cut":false,"hidden":false,"merged":[]}
["Ведомство","Советы","Соцсети","Индекс OC","Индекс СС","Индекс"]
["Главное управление специальных программ Президента Российской Федерации (ГУСП)",0,0,{"$f":"IF(B2>=0.7,\"A\",IF(B2>0.4,\"B\",\"C\"))","v":"C"},{"$f":"IF(C2>=0.7,\"A\",IF(C2>0.4,\"B\",\"C\"))","v":"C"},{"$f":"IF(AND(D2=\"A\",E2=\"A\"),\"A\",IF(OR(D2=\"C\",E2=\"C\"),\"C\",\"B\"))","v":"C"}]
["Государственная фельдъегерская служба Российской Федерации (ГФС России)",0,0,{"$f":"IF(B3>=0.7,\"A\",IF(B3>0.4,\"B\",\"C\"))","v":"C"},{"$f":"IF(C3>=0.7,\"A\",IF(C3>0.4,\"B\",\"C\"))","v":"C"},{"$f":"IF(AND(D3=\"A\",E3=\"A\"),\"A\",IF(OR(D3=\"C\",E3=\"C\"),\"C\",\"B\"))","v":"C"}]
["Казначейство России",0.45283018867924529,0.52941176499999998,{"$f":"IF(B4>=0.7,\"A\",IF(B4>0.4,\"B\",\"C\"))","v":"B"},{"$f":"IF(C4>=0.7,\"A\",IF(C4>0.4,\"B\",\"C\"))","v":"B"},{"$f":"IF(AND(D4=\"A\",E4=\"A\"),\"A\",IF(OR(D4=\"C\",E4=\"C\"),\"C\",\"B\"))","v":"B"}]
["Пробирная палата (?)",0,0,{"$f":"IF(B5>=0.7,\"A\",IF(B5>0.4,\"B\",\"C\"))","v":"C"},{"$f":"IF(C5>=0.7,\"A\",IF(C5>0.4,\"B\",\"C\"))","v":"C"},{"$f":"IF(AND(D5=\"A\",E5=\"A\"),\"A\",IF(OR(D5=\"C\",E5=\"C\"),\"C\",\"B\"))","v":"C"}]
["Росавиация",0.37735849056603776,0.29411764699999998,{"$f":"IF(B6>=0.7,\"A\",IF(B6>0.4,\"B\",\"C\"))","v":"C"},{"$f":"IF(C6>=0.7,\"A\",IF(C6>0.4,\"B\",\"C\"))","v":"C"},{"$f":"IF(AND(D6=\"A\",E6=\"A\"),\"A\",IF(OR(D6=\"C\",E6=\"C\"),\"C\",\"B\"))","v":"C"}]
["Росавтодор",0.660377358490566,0.64705882400000003,{"$f":"IF(B7>=0.7,\"A\",IF(B7>0.4,\"B\",\"C\"))","v":"B"},{"$f":"IF(C7>=0.7,\"A\",IF(C7>0.4,\"B\",\"C\"))","v":"B"},{"$f":"IF(AND(D7=\"A\",E7=\"A\"),\"A\",IF(OR(D7=\"C\",E7=\"C\"),\"C\",\"B\"))","v":"B"}]
["Росаккредитация",0.43396226415094336,0.47058823500000002,{"$f":"IF(B8>=0.7,\"A\",IF(B8>0.4,\"B\",\"C\"))","v":"B"},{"$f":"IF(C8>=0.7,\"A\",IF(C8>0.4,\"B\",\"C\"))","v":"B"},{"$f":"IF(AND(D8=\"A\",E8=\"A\"),\"A\",IF(OR(D8=\"C\",E8=\"C\"),\"C\",\"B\"))","v":"B"}]
["Росалкогольрегулирование",0.24528301886792453,0.52941176499999998,{"$f":"IF(B9>=0.7,\"A\",IF(B9>0.4,\"B\",\"C\"))","v":"C"},{"$f":"IF(C9>=0.7,\"A\",IF(C9>0.4,\"B\",\"C\"))","v":"B"},{"$f":"IF(AND(D9=\"A\",E9=\"A\"),\"A\",IF(OR(D9=\"C\",E9=\"C\"),\"C\",\"B\"))","v":"C"}]
["Росархив",0.71698113207547165,0.47058823500000002,{"$f":"IF(B10>=0.7,\"A\",IF(B10>0.4,\"B\",\"C\"))","v":"A"},{"$f":"IF(C10>=0.7,\"A\",IF(C10>0.4,\"B\",\"C\"))","v":"B"},{"$f":"IF(AND(D10=\"A\",E10=\"A\"),\"A\",IF(OR(D10=\"C\",E10=\"C\"),\"C\",\"B\"))","v":"B"}]
["Росводресурсы",0.30188679245283018,0,{"$f":"IF(B11>=0.7,\"A\",IF(B11>0.4,\"B\",\"C\"))","v":"C"},{"$f":"IF(C11>=0.7,\"A\",IF(C11>0.4,\"B\",\"C\"))","v":"C"},{"$f":"IF(AND(D11=\"A\",E11=\"A\"),\"A\",IF(OR(D11=\"C\",E11=\"C\"),\"C\",\"B\"))","v":"C"}]
["Росгвардия",0,0.47058823500000002,{"$f":"IF(B12>=0.7,\"A\",IF(B12>0.4,\"B\",\"C\"))","v":"C"},{"$f":"IF(C12>=0.7,\"A\",IF(C12>0.4,\"B\",\"C\"))","v":"B"},{"$f":"IF(AND(D12=\"A\",E12=\"A\"),\"A\",IF(OR(D12=\"C\",E12=\"C\"),\"C\",\"B\"))","v":"C"}]
["Росгидромет",0.52830188679245282,0.52941176499999998,{"$f":"IF(B13>=0.7,\"A\",IF(B13>0.4,\"B\",\"C\"))","v":"B"},{"$f":"IF(C13>=0.7,\"A\",IF(C13>0.4,\"B\",\"C\"))","v":"B"},{"$f":"IF(AND(D13=\"A\",E13=\"A\"),\"A\",IF(OR(D13=\"C\",E13=\"C\"),\"C\",\"B\"))","v":"B"}]
["Росжелдор",0.50943396226415094,0,{"$f":"IF(B14>=0.7,\"A\",IF(B14>0.4,\"B\",\"C\"))","v":"B"},{"$f":"IF(C14>=0.7,\"A\",IF(C14>0.4,\"B\",\"C\"))","v":"C"},{"$f":"IF(AND(D14=\"A\",E14=\"A\"),\"A\",IF(OR(D14=\"C\",E14=\"C\"),\"C\",\"B\"))","v":"C"}]
["Росздравнадзор",0.37735849056603776,0.29411764699999998,{"$f":"IF(B15>=0.7,\"A\",IF(B15>0.4,\"B\",\"C\"))","v":"C"},{"$f":"IF(C15>=0.7,\"A\",IF(C15>0.4,\"B\",\"C\"))","v":"C"},{"$f":"IF(AND(D15=\"A\",E15=\"A\"),\"A\",IF(OR(D15=\"C\",E15=\"C\"),\"C\",\"B\"))","v":"C"}]
["Росимущество",0.43396226415094341,0.64705882400000003,{"$f":"IF(B16>=0.7,\"A\",IF(B16>0.4,\"B\",\"C\"))","v":"B"},{"$f":"IF(C16>=0.7,\"A\",IF(C16>0.4,\"B\",\"C\"))","v":"B"},{"$f":"IF(AND(D16=\"A\",E16=\"A\"),\"A\",IF(OR(D16=\"C\",E16=\"C\"),\"C\",\"B\"))","v":"B"}]
["Роскомнадзор",0.22641509433962265,0.41176470599999998,{"$f":"IF(B17>=0.7,\"A\",IF(B17>0.4,\"B\",\"C\"))","v":"C"},{"$f":"IF(C17>=0.7,\"A\",IF(C17>0.4,\"B\",\"C\"))","v":"B"},{"$f":"IF(AND(D17=\"A\",E17=\"A\"),\"A\",IF(OR(D17=\"C\",E17=\"C\"),\"C\",\"B\"))","v":"C"}]
["Рослесхоз",0.43396226415094341,0.58823529399999996,{"$f":"IF(B18>=0.7,\"A\",IF(B18>0.4,\"B\",\"C\"))","v":"B"},{"$f":"IF(C18>=0.7,\"A\",IF(C18>0.4,\"B\",\"C\"))","v":"B"},{"$f":"IF(AND(D18=\"A\",E18=\"A\"),\"A\",IF(OR(D18=\"C\",E18=\"C\"),\"C\",\"B\"))","v":"B"}]
["Росмолодёжь",0.26415094339622636,0.58823529399999996,{"$f":"IF(B19>=0.7,\"A\",IF(B19>0.4,\"B\",\"C\"))","v":"C"},{"$f":"IF(C19>=0.7,\"A\",IF(C19>0.4,\"B\",\"C\"))","v":"B"},{"$f":"IF(AND(D19=\"A\",E19=\"A\"),\"A\",IF(OR(D19=\"C\",E19=\"C\"),\"C\",\"B\"))","v":"C"}]
["Росморречфлот",0.43396226415094341,0.41176470599999998,{"$f":"IF(B20>=0.7,\"A\",IF(B20>0.4,\"B\",\"C\"))","v":"B"},{"$f":"IF(C20>=0.7,\"A\",IF(C20>0.4,\"B\",\"C\"))","v":"B"},{"$f":"IF(AND(D20=\"A\",E20=\"A\"),\"A\",IF(OR(D20=\"C\",E20=\"C\"),\"C\",\"B\"))","v":"B"}]
["Роснедра",0.39622641509433965,0,{"$f":"IF(B21>=0.7,\"A\",IF(B21>0.4,\"B\",\"C\"))","v":"C"},{"$f":"IF(C21>=0.7,\"A\",IF(C21>0.4,\"B\",\"C\"))","v":"C"},{"$f":"IF(AND(D21=\"A\",E21=\"A\"),\"A\",IF(OR(D21=\"C\",E21=\"C\"),\"C\",\"B\"))","v":"C"}]
["Рособрнадзор",0.32075471698113206,0.41176470599999998,{"$f":"IF(B22>=0.7,\"A\",IF(B22>0.4,\"B\",\"C\"))","v":"C"},{"$f":"IF(C22>=0.7,\"A\",IF(C22>0.4,\"B\",\"C\"))","v":"B"},{"$f":"IF(AND(D22=\"A\",E22=\"A\"),\"A\",IF(OR(D22=\"C\",E22=\"C\"),\"C\",\"B\"))","v":"C"}]
["Роспатент",0.56603773584905659,0.58823529399999996,{"$f":"IF(B23>=0.7,\"A\",IF(B23>0.4,\"B\",\"C\"))","v":"B"},{"$f":"IF(C23>=0.7,\"A\",IF(C23>0.4,\"B\",\"C\"))","v":"B"},{"$f":"IF(AND(D23=\"A\",E23=\"A\"),\"A\",IF(OR(D23=\"C\",E23=\"C\"),\"C\",\"B\"))","v":"B"}]
["Роспечать",0.28301886792452829,0,{"$f":"IF(B24>=0.7,\"A\",IF(B24>0.4,\"B\",\"C\"))","v":"C"},{"$f":"IF(C24>=0.7,\"A\",IF(C24>0.4,\"B\",\"C\"))","v":"C"},{"$f":"IF(AND(D24=\"A\",E24=\"A\"),\"A\",IF(OR(D24=\"C\",E24=\"C\"),\"C\",\"B\"))","v":"C"}]
["Роспотребнадзор",0.50943396226415094,0.35294117600000002,{"$f":"IF(B25>=0.7,\"A\",IF(B25>0.4,\"B\",\"C\"))","v":"B"},{"$f":"IF(C25>=0.7,\"A\",IF(C25>0.4,\"B\",\"C\"))","v":"C"},{"$f":"IF(AND(D25=\"A\",E25=\"A\"),\"A\",IF(OR(D25=\"C\",E25=\"C\"),\"C\",\"B\"))","v":"C"}]
["Росприроднадзор",0.18867924528301888,0.64705882400000003,{"$f":"IF(B26>=0.7,\"A\",IF(B26>0.4,\"B\",\"C\"))","v":"C"},{"$f":"IF(C26>=0.7,\"A\",IF(C26>0.4,\"B\",\"C\"))","v":"B"},{"$f":"IF(AND(D26=\"A\",E26=\"A\"),\"A\",IF(OR(D26=\"C\",E26=\"C\"),\"C\",\"B\"))","v":"C"}]
["Росреестр",0.64150943396226412,0.52941176499999998,{"$f":"IF(B27>=0.7,\"A\",IF(B27>0.4,\"B\",\"C\"))","v":"B"},{"$f":"IF(C27>=0.7,\"A\",IF(C27>0.4,\"B\",\"C\"))","v":"B"},{"$f":"IF(AND(D27=\"A\",E27=\"A\"),\"A\",IF(OR(D27=\"C\",E27=\"C\"),\"C\",\"B\"))","v":"B"}]
["Росрезерв",0,0.58823529399999996,{"$f":"IF(B28>=0.7,\"A\",IF(B28>0.4,\"B\",\"C\"))","v":"C"},{"$f":"IF(C28>=0.7,\"A\",IF(C28>0.4,\"B\",\"C\"))","v":"B"},{"$f":"IF(AND(D28=\"A\",E28=\"A\"),\"A\",IF(OR(D28=\"C\",E28=\"C\"),\"C\",\"B\"))","v":"C"}]
["Росрыболовство",0.49056603773584906,0.29411764699999998,{"$f":"IF(B29>=0.7,\"A\",IF(B29>0.4,\"B\",\"C\"))","v":"B"},{"$f":"IF(C29>=0.7,\"A\",IF(C29>0.4,\"B\",\"C\"))","v":"C"},{"$f":"IF(AND(D29=\"A\",E29=\"A\"),\"A\",IF(OR(D29=\"C\",E29=\"C\"),\"C\",\"B\"))","v":"C"}]
["Россвязь",0.33962264150943394,0.47058823500000002,{"$f":"IF(B30>=0.7,\"A\",IF(B30>0.4,\"B\",\"C\"))","v":"C"},{"$f":"IF(C30>=0.7,\"A\",IF(C30>0.4,\"B\",\"C\"))","v":"B"},{"$f":"IF(AND(D30=\"A\",E30=\"A\"),\"A\",IF(OR(D30=\"C\",E30=\"C\"),\"C\",\"B\"))","v":"C"}]
["Россельхознадзор",0.56603773584905659,5.8823528999999999E-2,{"$f":"IF(B31>=0.7,\"A\",IF(B31>0.4,\"B\",\"C\"))","v":"B"},{"$f":"IF(C31>=0.7,\"A\",IF(C31>0.4,\"B\",\"C\"))","v":"C"},{"$f":"IF(AND(D31=\"A\",E31=\"A\"),\"A\",IF(OR(D31=\"C\",E31=\"C\"),\"C\",\"B\"))","v":"C"}]
["Россотрудничество",0,0.47058823500000002,{"$f":"IF(B32>=0.7,\"A\",IF(B32>0.4,\"B\",\"C\"))","v":"C"},{"$f":"IF(C32>=0.7,\"A\",IF(C32>0.4,\"B\",\"C\"))","v":"B"},{"$f":"IF(AND(D32=\"A\",E32=\"A\"),\"A\",IF(OR(D32=\"C\",E32=\"C\"),\"C\",\"B\"))","v":"C"}]
["Росстандарт",0.39622641509433965,0.64705882400000003,{"$f":"IF(B33>=0.7,\"A\",IF(B33>0.4,\"B\",\"C\"))","v":"C"},{"$f":"IF(C33>=0.7,\"A\",IF(C33>0.4,\"B\",\"C\"))","v":"B"},{"$f":"IF(AND(D33=\"A\",E33=\"A\"),\"A\",IF(OR(D33=\"C\",E33=\"C\"),\"C\",\"B\"))","v":"C"}]
["Росстат",0.52830188679245282,0.70588235300000002,{"$f":"IF(B34>=0.7,\"A\",IF(B34>0.4,\"B\",\"C\"))","v":"B"},{"$f":"IF(C34>=0.7,\"A\",IF(C34>0.4,\"B\",\"C\"))","v":"A"},{"$f":"IF(AND(D34=\"A\",E34=\"A\"),\"A\",IF(OR(D34=\"C\",E34=\"C\"),\"C\",\"B\"))","v":"B"}]
["Ростехнадзор",0.49056603773584906,0.58823529399999996,{"$f":"IF(B35>=0.7,\"A\",IF(B35>0.4,\"B\",\"C\"))","v":"B"},{"$f":"IF(C35>=0.7,\"A\",IF(C35>0.4,\"B\",\"C\"))","v":"B"},{"$f":"IF(AND(D35=\"A\",E35=\"A\"),\"A\",IF(OR(D35=\"C\",E35=\"C\"),\"C\",\"B\"))","v":"B"}]
["Ространснадзор",0.33962264150943394,0.17647058800000001,{"$f":"IF(B36>=0.7,\"A\",IF(B36>0.4,\"B\",\"C\"))","v":"C"},{"$f":"IF(C36>=0.7,\"A\",IF(C36>0.4,\"B\",\"C\"))","v":"C"},{"$f":"IF(AND(D36=\"A\",E36=\"A\"),\"A\",IF(OR(D36=\"C\",E36=\"C\"),\"C\",\"B\"))","v":"C"}]
["Роструд",0.16981132075471694,0.764705882,{"$f":"IF(B37>=0.7,\"A\",IF(B37>0.4,\"B\",\"C\"))","v":"C"},{"$f":"IF(C37>=0.7,\"A\",IF(C37>0.4,\"B\",\"C\"))","v":"A"},{"$f":"IF(AND(D37=\"A\",E37=\"A\"),\"A\",IF(OR(D37=\"C\",E37=\"C\"),\"C\",\"B\"))","v":"C"}]
["Ростуризм",0.47169811320754718,0.64705882400000003,{"$f":"IF(B38>=0.7,\"A\",IF(B38>0.4,\"B\",\"C\"))","v":"B"},{"$f":"IF(C38>=0.7,\"A\",IF(C38>0.4,\"B\",\"C\"))","v":"B"},{"$f":"IF(AND(D38=\"A\",E38=\"A\"),\"A\",IF(OR(D38=\"C\",E38=\"C\"),\"C\",\"B\"))","v":"B"}]
["Росфинмониторинг",0,0,{"$f":"IF(B39>=0.7,\"A\",IF(B39>0.4,\"B\",\"C\"))","v":"C"},{"$f":"IF(C39>=0.7,\"A\",IF(C39>0.4,\"B\",\"C\"))","v":"C"},{"$f":"IF(AND(D39=\"A\",E39=\"A\"),\"A\",IF(OR(D39=\"C\",E39=\"C\"),\"C\",\"B\"))","v":"C"}]
["СВР России",0,0,{"$f":"IF(B40>=0.7,\"A\",IF(B40>0.4,\"B\",\"C\"))","v":"C"},{"$f":"IF(C40>=0.7,\"A\",IF(C40>0.4,\"B\",\"C\"))","v":"C"},{"$f":"IF(AND(D40=\"A\",E40=\"A\"),\"A\",IF(OR(D40=\"C\",E40=\"C\"),\"C\",\"B\"))","v":"C"}]
["Управление делами Президента Российской Федерации",0.26396226415094343,0,{"$f":"IF(B41>=0.7,\"A\",IF(B41>0.4,\"B\",\"C\"))","v":"C"},{"$f":"IF(C41>=0.7,\"A\",IF(C41>0.4,\"B\",\"C\"))","v":"C"},{"$f":"IF(AND(D41=\"A\",E41=\"A\"),\"A\",IF(OR(D41=\"C\",E41=\"C\"),\"C\",\"B\"))","v":"C"}]
["ФАДН России",0.37735849056603776,0.64705882400000003,{"$f":"IF(B42>=0.7,\"A\",IF(B42>0.4,\"B\",\"C\"))","v":"C"},{"$f":"IF(C42>=0.7,\"A\",IF(C42>0.4,\"B\",\"C\"))","v":"B"},{"$f":"IF(AND(D42=\"A\",E42=\"A\"),\"A\",IF(OR(D42=\"C\",E42=\"C\"),\"C\",\"B\"))","v":"C"}]
["ФАС России",0.73584905660377353,0.82352941199999996,{"$f":"IF(B43>=0.7,\"A\",IF(B43>0.4,\"B\",\"C\"))","v":"A"},{"$f":"IF(C43>=0.7,\"A\",IF(C43>0.4,\"B\",\"C\"))","v":"A"},{"$f":"IF(AND(D43=\"A\",E43=\"A\"),\"A\",IF(OR(D43=\"C\",E43=\"C\"),\"C\",\"B\"))","v":"A"}]
["Федеральная служба судебных приставов (ФССП России)",0.58490566037735847,0.35294117600000002,{"$f":"IF(B44>=0.7,\"A\",IF(B44>0.4,\"B\",\"C\"))","v":"B"},{"$f":"IF(C44>=0.7,\"A\",IF(C44>0.4,\"B\",\"C\"))","v":"C"},{"$f":"IF(AND(D44=\"A\",E44=\"A\"),\"A\",IF(OR(D44=\"C\",E44=\"C\"),\"C\",\"B\"))","v":"C"}]
["ФМБА России",3.7735849056603772E-2,0.58823529399999996,{"$f":"IF(B45>=0.7,\"A\",IF(B45>0.4,\"B\",\"C\"))","v":"C"},{"$f":"IF(C45>=0.7,\"A\",IF(C45>0.4,\"B\",\"C\"))","v":"B"},{"$f":"IF(AND(D45=\"A\",E45=\"A\"),\"A\",IF(OR(D45=\"C\",E45=\"C\"),\"C\",\"B\"))","v":"C"}]
["ФНС России",0.56603773584905659,0.47058823500000002,{"$f":"IF(B46>=0.7,\"A\",IF(B46>0.4,\"B\",\"C\"))","v":"B"},{"$f":"IF(C46>=0.7,\"A\",IF(C46>0.4,\"B\",\"C\"))","v":"B"},{"$f":"IF(AND(D46=\"A\",E46=\"A\"),\"A\",IF(OR(D46=\"C\",E46=\"C\"),\"C\",\"B\"))","v":"B"}]
["ФСБ России",0.11320754716981132,0,{"$f":"IF(B47>=0.7,\"A\",IF(B47>0.4,\"B\",\"C\"))","v":"C"},{"$f":"IF(C47>=0.7,\"A\",IF(C47>0.4,\"B\",\"C\"))","v":"C"},{"$f":"IF(AND(D47=\"A\",E47=\"A\"),\"A\",IF(OR(D47=\"C\",E47=\"C\"),\"C\",\"B\"))","v":"C"}]
["ФСВТС России",0,0,{"$f":"IF(B48>=0.7,\"A\",IF(B48>0.4,\"B\",\"C\"))","v":"C"},{"$f":"IF(C48>=0.7,\"A\",IF(C48>0.4,\"B\",\"C\"))","v":"C"},{"$f":"IF(AND(D48=\"A\",E48=\"A\"),\"A\",IF(OR(D48=\"C\",E48=\"C\"),\"C\",\"B\"))","v":"C"}]
["ФСИН России",0.33962264150943394,0.58823529399999996,{"$f":"IF(B49>=0.7,\"A\",IF(B49>0.4,\"B\",\"C\"))","v":"C"},{"$f":"IF(C49>=0.7,\"A\",IF(C49>0.4,\"B\",\"C\"))","v":"B"},{"$f":"IF(AND(D49=\"A\",E49=\"A\"),\"A\",IF(OR(D49=\"C\",E49=\"C\"),\"C\",\"B\"))","v":"C"}]
["ФСО России",0,0,{"$f":"IF(B50>=0.7,\"A\",IF(B50>0.4,\"B\",\"C\"))","v":"C"},{"$f":"IF(C50>=0.7,\"A\",IF(C50>0.4,\"B\",\"C\"))","v":"C"},{"$f":"IF(AND(D50=\"A\",E50=\"A\"),\"A\",IF(OR(D50=\"C\",E50=\"C\"),\"C\",\"B\"))","v":"C"}]
["ФСТЭК России",0,0,{"$f":"IF(B51>=0.7,\"A\",IF(B51>0.4,\"B\",\"C\"))","v":"C"},{"$f":"IF(C51>=0.7,\"A\",IF(C51>0.4,\"B\",\"C\"))","v":"C"},{"$f":"IF(AND(D51=\"A\",E51=\"A\"),\"A\",IF(OR(D51=\"C\",E51=\"C\"),\"C\",\"B\"))","v":"C"}]
["ФТС России",0.50943396226415094,0,{"$f":"IF(B52>=0.7,\"A\",IF(B52>0.4,\"B\",\"C\"))","v":"B"},{"$f":"IF(C52>=0.7,\"A\",IF(C52>0.4,\"B\",\"C\"))","v":"C"},{"$f":"IF(AND(D52=\"A\",E52=\"A\"),\"A\",IF(OR(D52=\"C\",E52=\"C\"),\"C\",\"B\"))","v":"C"}]

{"sheet":"ОС Министерства","index":2,"n_rows":24,"n_cols":27,"rows_kept":24,"cut":false,"hidden":false,"merged":[[1,0,2,0],[1,17,1,19],[1,21,1,23],[1,2,1,5],[1,6,1,12],[1,13,1,16]]}
[]
["Ведомство","Наличие сайта, либо раздела ОС","Информация о членах ОС",null,null,null,"Информация о работе ОС",{"$nulls":6},"Доступность коммуникации с ОС",null,null,null,"Степень автономии ОС от ФОИВ",null,null,"Степень влияния ОС на деятельность ФОИВ","Степень активности ОС",null,null,null,"MAX:",53]
[null,"Наличие сайта, либо раздела ОС","Перечень лиц, входящих в состав общественного совета (ФИО)","Указание на организацию/орган/учреждение, должности лиц, входящих в состав общественного совета","Фотографии лиц, входящих в состав общественного совета","Контактная информация членов общественного совета","Положение об общественном совете","Наличие на сайте органа власти отдельной новостной ленты, посвященной работе общественного совета","План предстоящих заседаний общественного совета","Повестки предстоящих заседаний общественного совета","Протоколы прошедших заседаний общественного совета","Тексты решений общественного совета, одобренных на заседаниях общественного совета","Перечень рабочих групп (комиссий либо иных подразделений) в составе общественного совета","Текст правового акта о порядке участия в открытых заседаниях общественного совета","Возможность обращения в общественный совет (его структурное подразделение) через сайт","Возможность задать вопрос членам общественного совета на сайте","Наличие на сайте открытой дискуссионной площадки для обсуждения предложений и заключений общественного совета по разрабатываемым органом власти проектам НПА, документам и инициативам (чат, форум)","Наличие норм в Положении об ОС о необходимости формирования большей части состава ОС из представителей НКО. Насколько процедура формирвования состава в Положении обеспечивает независимость ОС от ФОИВ","Состав ОС - наличие общественных деятелей, представителей НКО","Отсутствие сообщений в СМИ о нарушениях в работе ОС, о вмешательстве ФОИВ в работу ОС","Включение руководителя, заместителя руководителя ОС в состав Коллегии министерства","Сколько раз проводились заседания в течение прошедшего года","Проводились ли очные заседания (наличие материалов, указывающих на очную форму участия членов в заседаниях)","Выражали ли члены ОС позицию по наиболее резонансным вопросам деятельности ведомства в публичном пространстве, в том числе в СМИ","Приглашаются ли на заседания СМИ и общественность","Сумма"]
["МВД России",2,1,3,3,0,1,3,1.9999999999999996,1.9999999999999996,1.9999999999999996,1,0.99999999999999978,0.99999999999999978,0,0,0,0.99999999999999978,0.99999999999999978,1,0,1.9999999999999996,3,0.99999999999999978,0,{"$f":"SUM(B4:Y4)","v":31},{"$f":"Z4/$AA$2","v":0.58490566037735847}]
["МИД России",0,0,0,0,0,0,0,0,0,0,0,0,0,0,0,0,0,0,0,0,0,0,0,0,0,0]
["Минвостокразвития России",0.99999999999999978,0,0,0,0,1,0,0,0,0,0,0,0.99999999999999978,0,0,0,0.99999999999999978,0,1,0,0,0,1.9999999999999996,0,6.9999999999999982,0.13207547169811318]
["Минздрав России",0.99999999999999978,1,3,0.99999999999999978,0,1,0,0,0,3,1,0,0,0,0,0,3,3,1,0,3,3,0,0,24,0.45283018867924529]
["Минкомсвязь России",0.99999999999999978,0,0,0,0,1,0,0,0,0,0,0,0.99999999999999978,0,0,0,0.99999999999999978,0,1,0,0,0,0,0,4.9999999999999991,9.4339622641509413E-2]
["Минкультуры России",0.99999999999999978,1,3,0.99999999999999978,0,1,0.99999999999999978,3,3,3,0,1.9999999999999996,0,1,1,0,3,3,1,0.99999999999999978,3,3,2,0,37,0.69811320754716977]
["Минобороны России",0.99999999999999978,1,3,0,0,1,0,0,0,0,0,0,0,0,0,0,0,0.99999999999999978,1,0,0,0,0.99999999999999978,0,9,0.16981132075471697]
["Минобрнауки России",0.99999999999999978,1,3,3,0,1,3,0,0,0,0,0,0.99999999999999978,0,0,0,1.9999999999999996,3,1,0,3,3,0,0,25,0.47169811320754718]
["Минприроды России",0.99999999999999978,1,0.99999999999999978,3,0,1,0.99999999999999978,3,0,0,1,0,0.99999999999999978,0,0,0,1.9999999999999996,3,1,0,3,3,2,0,27,0.50943396226415094]
["Минпромторг России",0.99999999999999978,1,3,0.99999999999999978,0,1,0,0,0,0,0,0,0.99999999999999978,0,0,0,3,0.99999999999999978,1,0,0,0,0,0,13,0.24528301886792453]
["Минпросвещения России",0.99999999999999978,1,3,0,0,1,0,0,0,0,0,0,0.99999999999999978,0,0,0,3,0,1,0,0,0,0,0,11,0.20754716981132076]
["Минсельхоз России",0,1,3,0,0,0,0,0,0,0,0,0,0,0,0,0,1.9999999999999996,0.99999999999999978,1,0.99999999999999978,0,0,0,0,9,0.16981132075471697]
["Минспорт России",2,1,3,3,0,1,3,0,0,3,1,3,0.99999999999999978,1,0,0,1.9999999999999996,3,1,2,3,3,0,1,37,0.69811320754716977]
["Минстрой России",2,1,3,3,0,1,3,3,0,0,0,3,0.99999999999999978,1,1,0,1.9999999999999996,1.9999999999999996,1,2,3,3,2,1,38,0.71698113207547165]
["Минтранс России",0.99999999999999978,1,3,0.99999999999999978,0,1,0.99999999999999978,0,0,0.99999999999999978,1,1.9999999999999996,0.99999999999999978,0,0,0,0.99999999999999978,1.9999999999999996,1,2,0.99999999999999978,3,2,0,25,0.47169811320754718]
["Минтруд России",0.99999999999999978,1,0.99999999999999978,0.99999999999999978,0.99999999999999978,1,3,0,0,0,0,3,0.99999999999999978,1,0,0,1.9999999999999996,3,1,2,3,3,0,1,29,0.54716981132075471]
["Минфин России",0.99999999999999978,1,3,3,0,1,0.99999999999999978,0,3,3,1,0.99999999999999978,0.99999999999999978,0,0,0,1.9999999999999996,1.9999999999999996,1,0,3,0.99999999999999978,0,0,28,0.52830188679245282]
["Минэкономразвития России",0.99999999999999978,1,1.9999999999999996,0,0,1,0,0,0,3,1,0,0.99999999999999978,1,0,0,1.9999999999999996,3,1,0,3,0,0,0,20,0.37735849056603776]
["Минэнерго России",0.99999999999999978,1,3,3,0,0,0,0,0,3,1,3,0,0,0,0,1.9999999999999996,1.9999999999999996,1,0,3,0.99999999999999978,0,0,24,0.45283018867924529]
["Минюст России",0.99999999999999978,1,3,0,0,1,0,0,0,0,0,0,0,0,0,0,0,0,1,0,0,0,0,0,7,0.13207547169811321]
["МЧС России",0.99999999999999978,1,0,0,0,1,0,1.9999999999999996,0.99999999999999978,3,1,0,0.99999999999999978,0,0,0,0,1.9999999999999996,1,0,0.99999999999999978,3,0,1,19,0.35849056603773582]

{"sheet":"СС Министерства","index":3,"n_rows":22,"n_cols":23,"rows_kept":22,"cut":false,"hidden":false,"merged":[]}
["Ведомство","VK","FB","OK","Inst","has_sm_account","has_contacts_ sm","period_post","Erpost_VK","TR _VK","Erpost_Fb","TR_Fb","Erpost_Ок","TR_Ok","Erpost_Inst","TR_Inst","ER_post_rate","TR_rate","sm_feedback","sm_feedback_content","sm_feedback_content_dtl","Total "]
["МВД России","https://vk.com/mvd (205 928)","https://www.facebook.com/mvd.official (17 083)","http://ok.ru/mvd (197007)","https://www.instagram.com/mvd.russia/ (224 170)",3,1,2,0.114,0,0.42099999999999999,0.02,7.8E-2,0,0.71499999999999997,5.0000000000000001E-3,2,2,1,0,"0 (Инстаграм)",{"$f":"SUM(Q2:T2,H2,G2,F2)","v":11},{"$f":"$V2/[1]Коды!$D$28","v":0.6470588235294118}]
["МИД России","https://vk.com/mid (406 405)","https://www.facebook.com/MIDRussia (392 427)","нет аккаунта ","https://www.instagram.com/mid.rus/ (271 008)",1,1,2,1.4999999999999999E-2,2E-3,4.2000000000000003E-2,3.0000000000000001E-3,0,0,0.46800000000000003,0.01,1,1,1,0,"0 (ВКонтакте)",7,{"$f":"V3/[1]Коды!$D$28","v":0.41176470588235292}]
["Минвостокразвития России","нет аккаунта ","https://www.facebook.com/MinVostok (5 017)","нет аккаунта ","https://www.instagram.com/minvostok/ (2 537)",1,0,2,0,0,0.32,7.0000000000000001E-3,0,0,2.9649999999999999,0.11899999999999999,3,3,0,0,"0 (нельзя написать сообщение)",9,{"$f":"V4/[1]Коды!$D$28","v":0.52941176470588236}]
["Минздрав России","https://vk.com/public114069515 (86 431)","https://www.facebook.com/MinzdravRu/ (23 974)","https://ok.ru/minzdravru (142201)","нет аккаунта ",1,0,2,0.55600000000000005,0,0.34499999999999997,3.4000000000000002E-2,0.17699999999999999,1.4999999999999999E-2,0,0,2,1,1,0,"0 (Одноклассники)",7,{"$f":"V5/[1]Коды!$D$28","v":0.41176470588235292}]
["Минкомсвязь России","нет аккаунта ","https://www.facebook.com/minsvyaz.place (4 895)","нет аккаунта ","нет аккаунта ",1,1,2,0.51,1.0999999999999999E-2,0,0,0,0,0,0,2,1,1,0,"0 (Фейсбук)",8,{"$f":"$V6/[1]Коды!$D$28","v":0.47058823529411764}]
["Минкультуры России","https://vk.com/club56049514 (33 962","https://www.facebook.com/minkultrf (10 352)","https://ok.ru/mkrf/ (49970)","https://www.instagram.com/mincult_russia/?hl=ru (84 404)",3,1,2,0.183,4.0000000000000001E-3,0.49,1.2999999999999999E-2,6.5000000000000002E-2,2E-3,0.54100000000000004,1.0999999999999999E-2,2,2,1,2,"2 (Инстаграм)",13,{"$f":"$V7/[1]Коды!$D$28","v":0.76470588235294112}]
["Минобороны России","http://vk.com/mil (413 954)","https://www.facebook.com/pages/Минобороны-России/1492252324350852 (233 056)","https://ok.ru/mil (45575)","http://instagram.com/mil_ru (402 034)",3,1,2,8.3000000000000004E-2,4.0000000000000001E-3,0.16500000000000001,6.0000000000000001E-3,7.8E-2,3.0000000000000001E-3,1.0409999999999999,1.4E-2,3,1,2,0,"0 (ВКонтакте)",12,{"$f":"V8/[1]Коды!$D$28","v":0.70588235294117652}]
["Минобрнауки России","https://vk.com/minobrnauki (8 942)","https://www.facebook.com/minobrnaukigov/ (1 282)","нет аккаунта ","https://www.instagram.com/minobrnauki_russia/ (16 287)",1,1,2,0.35,8.0000000000000002E-3,2.0699999999999998,4.5999999999999999E-2,0,0,0.77800000000000002,2.1000000000000001E-2,3,2,1,2,"2 (Фейсбук)",12,{"$f":"V9/[1]Коды!$D$28","v":0.70588235294117652}]
["Минприроды России","нет аккаунта ","https://www.facebook.com/mnr.gov (6 451)","нет аккаунта ","нет аккаунта ",1,0,2,0,0,0.92700000000000005,3.2000000000000001E-2,0,0,0,0,2,1,0,0,"0 (нельзя написать сообщение)",6,{"$f":"V10/[1]Коды!$D$28","v":0.35294117647058826}]
["Минпромторг России","http://vk.com/minpromtorgrus (22 312)","http://www.facebook.com/minpromtorg (32 240)","нет аккаунта ","http://instagram.com/minpromtorg (50 411)",1,0,2,0.122,6.0000000000000001E-3,0.107,4.0000000000000001E-3,0,0,0.75900000000000001,1.4E-2,2,1,1,2,"2 (Инстаграм)",9,{"$f":"V11/[1]Коды!$D$28","v":0.52941176470588236}]
["Минпросвещения России","https://vk.com/minprosvet (273 956)","https://www.facebook.com/minprosvet (25 559)","https://ok.ru/minprosvet (111051)","https://www.instagram.com/minprosvet/ (92 622)",3,1,2,0.27,8.9999999999999993E-3,0.22600000000000001,8.9999999999999993E-3,4.9000000000000002E-2,2E-3,0.52700000000000002,8.9999999999999993E-3,2,1,1,0,"0 (ВКонтакте)",10,{"$f":"V12/[1]Коды!$D$28","v":0.58823529411764708}]
["Минсельхоз России","https://vk.com/minselhoz (5 506)","https://www.facebook.com/pages/Министерство-сельского-хозяйства-Российской-Федерации/162754797121848 (5 845)","https://ok.ru/group/58417191780400 (1431)","https://www.instagram.com/mcx_rf/ (31 079) ",3,1,2,0.95299999999999996,1.7999999999999999E-2,1.113,2.7E-2,0.13,2E-3,1.17,1.4E-2,3,1,1,0,"0 (Инстаграм)",11,{"$f":"$V13/[1]Коды!$D$28","v":0.6470588235294118}]
["Минспорт России"," https://vk.com/minsportrf (31 179)","https://www.facebook.com/minsportrf/ (932)","нет аккаунта ","https://www.instagram.com/minsport_rf/ (25 122)",1,0,2,0.26900000000000002,8.5999999999999993E-2,1.2150000000000001,2.3E-2,0,0,1.196,2.5000000000000001E-2,3,2,1,1,"1 (Вконтакте, 13.05)",10,{"$f":"V14/[1]Коды!$D$28","v":0.58823529411764708}]
["Минстрой России","http://vk.com/minstroyrfofficial (10 055)","https://www.facebook.com/minstroyrf (16 384)","http://ok.ru/group/53598208065632 (28459)","https://www.instagram.com/minstroyrf/ (31 710)",3,1,2,0.35099999999999998,0,0.35099999999999998,2.9000000000000001E-2,3.7999999999999999E-2,2E-3,0.91,4.1000000000000002E-2,2,2,1,0,"0 (Инстаграм)",11,{"$f":"V15/[1]Коды!$D$28","v":0.6470588235294118}]
["Минтранс России","https://vk.com/mintransrussia (1 476)","https://www.facebook.com/MintransRussia (1992)","нет аккаунта ","https://instagram.com/mintransrussia/ (21 235)",1,1,2,0.57199999999999995,2.9000000000000001E-2,0.59399999999999997,2.1999999999999999E-2,0,0,0.97299999999999998,0,2,1,1,0,"0 (Инстаграм)",8,{"$f":"V16/[1]Коды!$D$28","v":0.47058823529411764}]
["Минтруд России","нет аккаунта ","нет аккаунта ","нет аккаунта ","нет аккаунта ",1,0,0,0,0,0,0,0,0,0,0,0,0,0,0,"0 (нельзя написать сообщение)",1,{"$f":"V17/[1]Коды!$D$28","v":5.8823529411764705E-2}]
["Минфин России","https://vk.com/ruminfin (4 804)","https://www.facebook.com/ruMinFin (4 854)","нет аккаунта ","https://www.instagram.com/ruminfin/ (57 855)",1,1,2,0.504,1.4E-2,0.495,1.9E-2,0,0,0.54100000000000004,1.0999999999999999E-2,2,1,1,0,"0 (Инстаграм)",8,{"$f":"V18/[1]Коды!$D$28","v":0.47058823529411764}]
["Минэкономразвития России","https://vk.com/ministryeconomy (4 331)","http://www.facebook.com/MinistryEconomy (14 199)","нет аккаунта ","https://www.instagram.com/minec_russia/ (24 249)",1,1,2,0.28799999999999998,1.2999999999999999E-2,0.253,1.2E-2,0,0,1.147,2.5999999999999999E-2,3,1,1,0,"0 (Инстаграм)",9,{"$f":"V19/[1]Коды!$D$28","v":0.52941176470588236}]
["Минэнерго России","нет аккаунта ","http://www.facebook.com/Minenergo.Gov (5 231)","нет аккаунта ","https://www.instagram.com/minenergogov/ (21 908)",1,1,2,0,0,0.54800000000000004,2.5000000000000001E-2,0,0,2.2130000000000001,4.8000000000000001E-2,3,1,1,0,"0 (Инстаграм)",9,{"$f":"V20/[1]Коды!$D$28","v":0.52941176470588236}]
["Минюст России","нет аккаунта ","нет аккаунта ","нет аккаунта ","нет аккаунта ",0,0,0,0,0,0,0,0,0,0,0,0,0,0,0,"0 (нельзя написать сообщение)",0,{"$f":"V21/[1]Коды!$D$28","v":0}]
["МЧС России","https://vk.com/mchs__russia (208 423)","https://www.facebook.com/MchsRussia/?fref=ts (22 914)","http://ok.ru/mchsrussia (57613)","http://instagram.com/mchs.russia (111 245)",3,1,2,0.09,3.0000000000000001E-3,0.122,2E-3,4.7E-2,1E-3,0.872,1.2E-2,2,1,2,0,"0 (ВКонтакте)",11,{"$f":"V22/[1]Коды!$D$28","v":0.6470588235294118}]

{"sheet":"ОС Службы","index":4,"n_rows":53,"n_cols":27,"rows_kept":53,"cut":false,"hidden":false,"merged":[[1,0,2,0]]}
[]
["Ведомство","Наличие сайта, либо раздела ОС","Информация о членах ОС",null,null,null,"Информация о работе ОС",{"$nulls":6},"Доступность коммуникации с ОС",null,null,null,"Степень автономии ОС от ФОИВ",null,null,"Степень влияния ОС на деятельность ФОИВ","Степень активности ОС",null,null,null,"MAX:",53]
[null,"Наличие сайта, либо раздела ОС","Перечень лиц, входящих в состав общественного совета (ФИО)","Указание на организацию/орган/учреждение, должности лиц, входящих в состав общественного совета","Фотографии лиц, входящих в состав общественного совета","Контактная информация членов общественного совета","Положение об общественном совете","Наличие на сайте органа власти отдельной новостной ленты, посвященной работе общественного совета","План предстоящих заседаний общественного совета","Повестки предстоящих заседаний общественного совета","Протоколы прошедших заседаний общественного совета","Тексты решений общественного совета, одобренных на заседаниях общественного совета","Перечень рабочих групп (комиссий либо иных подразделений) в составе общественного совета","Текст правового акта о порядке участия в открытых заседаниях общественного совета","Возможность обращения в общественный совет (его структурное подразделение) через сайт","Возможность задать вопрос членам общественного совета на сайте","Наличие на сайте открытой дискуссионной площадки для обсуждения предложений и заключений общественного совета по разрабатываемым органом власти проектам НПА, документам и инициативам (чат, форум)","Наличие норм в Положении об ОС о необходимости формирования большей части состава ОС из представителей НКО. Насколько процедура формирвования состава в Положении обеспечивает независимость ОС от ФОИВ","Состав ОС - наличие общественных деятелей, представителей НКО","Отсутствие сообщений в СМИ о нарушениях в работе ОС, о вмешательстве ФОИВ в работу ОС","Включение руководителя, заместителя руководителя ОС в состав Коллегии министерства","Сколько раз проводились заседания в течение прошедшего года","Проводились ли очные заседания (наличие материалов, указывающих на очную форму участия членов в заседаниях)","Выражали ли члены ОС позицию по наиболее резонансным вопросам деятельности ведомства в публичном пространстве, в том числе в СМИ","Приглашаются ли на заседания СМИ и общественность","Сумма"]
["Главное управление специальных программ Президента Российской Федерации (ГУСП)",0,0,0,0,0,0,0,0,0,0,0,0,0,0,0,0,0,0,0,0,0,0,0,0,{"$f":"SUM(B4:Y4)","v":0},{"$f":"Z4/$AA$2","v":0}]
["Государственная фельдъегерская служба Российской Федерации (ГФС России)",0,0,0,0,0,0,0,0,0,0,0,0,0,0,0,0,0,0,0,0,0,0,0,0,0,0]
["Казначейство России",0.99999999999999978,1,3,3,3,0,0,0,0.99999999999999978,3,1,0,0.99999999999999978,0,0,0,0,3,1,0,0.99999999999999978,1.9999999999999996,0,0,24,0.45283018867924529]
["Росавиация",0.99999999999999978,1,0.99999999999999978,0.99999999999999978,0,1,0,3,0,3,1,0,0.99999999999999978,0,0,0,0,0.99999999999999978,0,0,1.9999999999999996,3,0.99999999999999978,0,20,0.37735849056603776]
["Росавтодор",2,1,3,3,3,1,3,0,0,3,1,1.9999999999999996,2,0,0,1.9999999999999996,0,0.99999999999999889,1,2,0.99999999999999889,3,0,1,35,0.660377358490566]
["Росаккредитация",0.99999999999999978,1,0.99999999999999978,0,0.99999999999999978,1,3,0,0,1.9999999999999996,0,1.9999999999999996,0.99999999999999978,0,0,0,3,0.99999999999999978,1,0.99999999999999978,0.99999999999999978,1.9999999999999996,0,1,22.999999999999996,0.43396226415094336]
["Росалкогольрегулирование",0.99999999999999978,1,0.99999999999999978,0,0,1,0,0,0,1.9999999999999996,0,0,0.99999999999999978,0,0,0,0,0.99999999999999978,1,0,0,1.9999999999999996,2,0,13,0.24528301886792453]
["Росархив",0.99999999999999978,1,3,3,3,1,3,3,1.9999999999999996,3,1,0,0.99999999999999978,1,1,0.99999999999999889,0,3,1,2,0.99999999999999889,1.9999999999999996,0,1,38,0.71698113207547165]
["Росводресурсы",0.99999999999999978,1,3,0,0,1,0,0,0,1.9999999999999996,0,0,0.99999999999999978,0,0,0,0,0.99999999999999978,1,0,1.9999999999999996,3,0,0,16,0.30188679245283018]
["Росгвардия",0,0,0,0,0,0,0,0,0,0,0,0,0,0,0,0,0,0,0,0,0,0,0,0,0,0]
["Росгидромет",0.99999999999999978,1,0.99999999999999978,0,0,1,3,1.9999999999999996,3,3,1,0,0.99999999999999978,0,0,0,0,0.99999999999999978,1,2,3,3,0.99999999999999978,0,28,0.52830188679245282]
["Росжелдор",0.99999999999999978,1,3,3,0,1,0,0.99999999999999978,0,3,1,1.9999999999999996,0.99999999999999978,0,0,0,0,1.9999999999999996,1,2,0.99999999999999978,3,0,1,27,0.50943396226415094]
["Росздравнадзор",0.99999999999999978,1,0.99999999999999978,0,0,1,3,1.9999999999999996,0,0,0,1.9999999999999996,0.99999999999999978,0,0,0,0,0.99999999999999978,1,2,0.99999999999999978,3,0,0,20,0.37735849056603776]
["Росимущество",0.99999999999999978,1,3,1.9999999999999996,0,1,1.9999999999999996,0,0,3,1,0,0.99999999999999978,0,0,0,0,3,1,0,3,0.99999999999999978,0,0,23,0.43396226415094341]
["Роскомнадзор",0.99999999999999978,1,3,0,0,1,0,0,0,0,0,0,2,0,0,0,0,0.99999999999999978,1,2,0,0,0,0,12,0.22641509433962265]
["Рослесхоз",0.99999999999999978,1,0.99999999999999978,0,0,1,0.99999999999999978,0,0,3,1,1.9999999999999996,0.99999999999999978,1,0,0,0,0.99999999999999978,1,0,3,3,0.99999999999999978,1,23,0.43396226415094341]
["Росмолодёжь",0.99999999999999978,1,0.99999999999999978,0.99999999999999978,0,1,0.99999999999999978,0,0,0.99999999999999978,1,0.99999999999999978,0.99999999999999978,0,0,0,0,0.99999999999999978,1,0,0.99999999999999978,0.99999999999999978,0,0,13.999999999999998,0.26415094339622636]
["Росморречфлот",0.99999999999999978,1,3,0.99999999999999978,0,1,0,0,0,0.99999999999999978,1,3,0.99999999999999978,1,0,0,3,0.99999999999999978,1,2,0.99999999999999978,0.99999999999999978,0,0,23,0.43396226415094341]
["Роснедра",0.99999999999999978,1,0.99999999999999978,3,0,1,0,0,0,3,1,0,0.99999999999999978,1,0,0,1.9999999999999996,0.99999999999999978,1,0,0.99999999999999978,3,0,0,21,0.39622641509433965]
["Рособрнадзор",0.99999999999999978,1,3,0,0,1,0,0,0,0.99999999999999978,1,0,0.99999999999999978,0,0,0,0,3,1,0,0.99999999999999978,3,0,0,17,0.32075471698113206]
["Роспатент",0.99999999999999978,1,3,3,3,1,3,0,3,3,1,1.9999999999999996,0.99999999999999978,0,0,0,0,1.9999999999999996,1,0,0.99999999999999978,0.99999999999999978,0,0,30,0.56603773584905659]
["Роспечать",0.99999999999999978,1,0.99999999999999978,0,0,0,0.99999999999999978,1.9999999999999996,0,0.99999999999999978,0,0,0,0,0,0,0,0.99999999999999978,1,2,0.99999999999999978,3,0,0,14.999999999999998,0.28301886792452829]
["Роспотребнадзор",0.99999999999999978,1,3,3,0,1,0,1.9999999999999996,0,3,1,0,0.99999999999999978,0,0,0,0,3,1,0,3,3,0,1,27,0.50943396226415094]
["Росприроднадзор",0.99999999999999978,1,0.99999999999999978,0,0,1,0,0,0,0,1,0,0.99999999999999978,0,0,0,0,0.99999999999999978,1,0,0.99999999999999978,0,0.99999999999999978,0,10,0.18867924528301888]
["Росреестр",0.99999999999999978,1,3,3,3,1,0,0,0,3,1,3,0.99999999999999978,0,0,0,1.9999999999999996,3,1,0.99999999999999978,3,3,0,1,34,0.64150943396226412]
["Росрезерв",0,0,0,0,0,0,0,0,0,0,0,0,0,0,0,0,0,0,0,0,0,0,0,0,0,0]
["Росрыболовство",0.99999999999999978,1,0.99999999999999978,0,0,1,3,0,3,3,1,0,0.99999999999999978,0,0,0,0,0.99999999999999978,0,2,3,3,0.99999999999999978,1,26,0.49056603773584906]
["Россвязь",0.99999999999999978,1,3,3,0,1,0,3,0,1.9999999999999996,0,0,0.99999999999999978,0,0,0,0,0.99999999999999978,1,0,0.99999999999999978,0,0,0,18,0.33962264150943394]
["Россельхознадзор",0.99999999999999978,1,3,3,3,1,3,0,0,1.9999999999999996,1,0,0.99999999999999978,0,0,0,0,3,1,0,3,3,0,1,30,0.56603773584905659]
["Россотрудничество",0,0,0,0,0,0,0,0,0,0,0,0,0,0,0,0,0,0,0,0,0,0,0,0,0,0]
["Росстандарт",0.99999999999999978,1,0.99999999999999978,0,0,1,0,0,0,3,1,1.9999999999999996,0.99999999999999978,0,0,0,0,0.99999999999999978,1,2,3,3,0,0,21,0.39622641509433965]
["Росстат",0.99999999999999978,1,3,3,3,1,1.9999999999999996,0,0,3,1,0,0.99999999999999978,0,0,0,1.9999999999999996,3,1,0,0.99999999999999978,0.99999999999999978,0.99999999999999978,0,28,0.52830188679245282]
["Ростехнадзор",0.99999999999999978,1,3,0,0,1,0,3,0,1.9999999999999996,1,1.9999999999999996,0.99999999999999978,0,0,0,0.99999999999999978,1.9999999999999996,1,0,3,3,0,1,{"$f":"SUM(B36:Y36)","v":26},{"$f":"Z36/$AA$2","v":0.49056603773584906}]
["Ространснадзор",0.99999999999999978,1,0.99999999999999978,0,0,1,0,0,0,0,0,0.99999999999999978,0.99999999999999978,0,0,0,3,0.99999999999999978,1,2,0.99999999999999978,1.9999999999999996,0.99999999999999978,1,18,0.33962264150943394]
["Роструд",0.99999999999999978,1,0.99999999999999978,0,0,1,0,0,0,0,0,0,0.99999999999999978,0,0,0,0,0.99999999999999978,1,0,0.99999999999999978,0.99999999999999978,0,0,8.9999999999999982,0.16981132075471694]
["Ростуризм",2,1,1.9999999999999996,3,0,1,3,0,0,0.99999999999999978,0,0.99999999999999978,0.99999999999999978,1,0,0,3,3,1,0,0.99999999999999978,0.99999999999999978,0,0,25,0.47169811320754718]
["Росфинмониторинг",0,0,0,0,0,0,0,0,0,0,0,0,0,0,0,0,0,0,0,0,0,0,0,0,0,0]
["СВР России",0,0,0,0,0,0,0,0,0,0,0,0,0,0,0,0,0,0,0,0,0,0,0,0,0,0]
["Управление делами Президента Российской Федерации",0.99999999999999978,1,3,0,0,1,0,0,0,1.9999999999999996,1,0,0.99999999999999978,0,0,0,0,0.98999999999999988,1,0,0.99999999999999978,0.99999999999999978,0,0,13.99,0.26396226415094343]
["ФАДН России",2,1,3,3,0,1,0.99999999999999978,0,0,0,0,0.99999999999999978,0.99999999999999978,1,1,0.99999999999999978,0,3,1,0,0,0,0,0,20,0.37735849056603776]
["ФАС России",2,1,3,3,0,1,3,0,3,3,1,3,0.99999999999999978,1,1,0,1.9999999999999996,1.9999999999999996,1,0,3,3,0.99999999999999978,1,39,0.73584905660377353]
["Федеральная служба судебных приставов (ФССП России)",2,1,3,3,1.9999999999999996,1,0,3,0,1.9999999999999996,0,0,0.99999999999999978,1,0,0,0,3,1,2,3,3,0,0,31,0.58490566037735847]
["ФМБА России",0.99999999999999978,0,0,0,0,0,0,0,0,0,0,0,0,0,0,0,0,0,1,0,0,0,0,0,1.9999999999999998,3.7735849056603772E-2]
["ФНС России",0.99999999999999978,1,3,3,0,1,0.99999999999999978,0,3,3,1,0.99999999999999978,0.99999999999999978,1,0,0,0,1.9999999999999996,1,0,3,3,0.99999999999999978,0,30,0.56603773584905659]
["ФСБ России",2,0,0,0,0,0,1.9999999999999996,0,0,0,0,0,0,0,0,0,0,0,1,0,0,0,0.99999999999999978,0,6,0.11320754716981132]
["ФСВТС России",0,0,0,0,0,0,0,0,0,0,0,0,0,0,0,0,0,0,0,0,0,0,0,0,0,0]
["ФСИН России",0.99999999999999978,1,3,0,0.99999999999999978,1,3,0,0,0,1,1.9999999999999996,0,0,0,0,0,0.99999999999999978,1,0,0,0.99999999999999978,2,0,18,0.33962264150943394]
["ФСО России",0,0,0,0,0,0,0,0,0,0,0,0,0,0,0,0,0,0,0,0,0,0,0,0,0,0]
["ФСТЭК России",0,0,0,0,0,0,0,0,0,0,0,0,0,0,0,0,0,0,0,0,0,0,0,0,0,0]
["ФТС России",2,1,3,0,0,1,3,1.9999999999999996,0,1.9999999999999996,1,1.9999999999999996,0.99999999999999978,1,0,0.99999999999999978,0,0.99999999999999978,1,0,1.9999999999999996,3,0,0,27,0.50943396226415094]

{"sheet":"СС Службы","index":5,"n_rows":52,"n_cols":23,"rows_kept":52,"cut":false,"hidden":false,"merged":[]}
["Ведомство","VK","FB","OK","Inst","has_sm_account","has_contacts_ sm","period_post","Erpost_VK","TR _VK","Erpost_Fb","TR_Fb","Erpost_OK","TR _OK","Erpost_Inst","TR_Inst","ER_post_rate","TR_post_rate","sm_feedback","sm_feedback_content","sm_feedback_content dtl "," Total ","Итог"]
["Главное управление специальных программ Президента Российской Федерации (ГУСП)","нет аккаунта","нет аккаунта","нет аккаунта","нет аккаунта",0,0,0,0,0,0,0,0,0,0,0,0,0,0,0,"0 (нельзя отправить сообщение)",{"$f":"SUM(F2,G2,H2,Q2,R2,S2,T2)","v":0},{"$f":"$V2/[1]Коды!$D$28","v":0}]
["Государственная фельдъегерская служба Российской Федерации (ГФС России)","нет аккаунта","нет аккаунта","нет аккаунта","нет аккаунта",0,0,0,0,0,0,0,0,0,0,0,0,0,0,0,"0 (нельзя отправить сообщение)",0,{"$f":"$V3/[1]Коды!$D$28","v":0}]
["Казначейство России","нет аккаунта",1744,"нет аккаунта",13278,1,1,2,0,0,0.88900000000000001,1.0999999999999999E-2,0,0,3.109,1.0999999999999999E-2,3,1,1,0,"0 (нет ответа) (Фейсбук)",9,{"$f":"$V4/[1]Коды!$D$28","v":0.52941176470588236}]
["Росавиация","нет аккаунта",498,"нет аккаунта",0,1,1,1,0,0,7.0999999999999994E-2,0.03,0,0,0,0,1,1,0,0,"0 (нельзя написать сообщение)",5,{"$f":"$V5/[1]Коды!$D$28","v":0.29411764705882354}]
["Росавтодор",160434,59165,35099,77407,3,1,1,0.22,7.8E-2,9.2999999999999999E-2,1.2E-2,3.3000000000000002E-2,2E-3,0.871,0.06,2,2,2,0,"0 (ВКонтакте)",11,{"$f":"$V6/[1]Коды!$D$28","v":0.6470588235294118}]
["Росаккредитация","нет аккаунта",451,"нет аккаунта","нет аккаунта",1,1,2,0,0,1.3979999999999999,3.2000000000000001E-2,0,0,0,0,3,1,0,0,"0 (нельзя отправить сообщение)",8,{"$f":"$V7/[1]Коды!$D$28","v":0.47058823529411764}]
["Росалкогольрегулирование",1092,347,"нет аккаунта",1219,1,1,2,2.1000000000000001E-2,7.0000000000000001E-3,0.378,1.4999999999999999E-2,0,0,2.9119999999999999,5.0000000000000001E-3,3,1,1,0,"0 (нет ответа) (ВК)",9,{"$f":"$V8/[1]Коды!$D$28","v":0.52941176470588236}]
["Росархив",2508,"нет аккаунта","нет аккаунта","нет аккаунта",1,1,1,1.764,2.4E-2,0,0,0,0,0,0,3,1,1,0,"0 (нет ответа) (ВК)",8,{"$f":"$V9/[1]Коды!$D$28","v":0.47058823529411764}]
["Росводресурсы","нет аккаунта","нет аккаунта","нет аккаунта","нет аккаунта",0,0,0,0,0,0,0,0,0,0,0,0,0,0,0,"0 (нельзя отправить сообщение)",0,{"$f":"$V10/[1]Коды!$D$28","v":0}]
["Росгвардия",63345,"нет аккаунта",206,80831,1,1,2,0.152,0,0,0,0.157,0,0.628,3.0000000000000001E-3,2,1,1,0,"0 (нет ответа) (Инстаграм)",8,{"$f":"$V11/[1]Коды!$D$28","v":0.47058823529411764}]
["Росгидромет",3894,1858,"нет аккаунта",1757,1,0,2,0.38400000000000001,5.0000000000000001E-3,0.21099999999999999,6.0000000000000001E-3,0,0,6.6660000000000004,0.435,3,2,1,0,"0 (Инстаграм)",9,{"$f":"$V12/[1]Коды!$D$28","v":0.52941176470588236}]
["Росжелдор","нет аккаунта","нет аккаунта","нет аккаунта","нет аккаунта",0,0,0,0,0,0,0,0,0,0,0,0,0,0,0,"0 (нельзя написать сообщение)",0,{"$f":"$V13/[1]Коды!$D$28","v":0}]
["Росздравнадзор",273,"нет аккаунта","нет аккаунта","нет аккаунта",1,0,1,3.8940000000000001,0,0,0,0,0,0,0,3,0,0,0,"0 (нельзя отправить сообщение)",5,{"$f":"$V14/[1]Коды!$D$28","v":0.29411764705882354}]
["Росимущество",0,2649,"нет аккаунта",2268,1,1,2,0,0,0.95299999999999996,0.04,0,0,6.2649999999999997,0.16,3,3,1,0,"0 (нет ответа) (Инстаграм)",11,{"$f":"$V15/[1]Коды!$D$28","v":0.6470588235294118}]
["Роскомнадзор",79896,7793,"нет аккаунта","нет аккаунта",1,1,2,8.8999999999999996E-2,3.5999999999999997E-2,0.10299999999999999,2.4E-2,0,0,0,0,1,1,1,0,"0 (нет ответа) (ВК)",7,{"$f":"$V16/[1]Коды!$D$28","v":0.41176470588235292}]
["Рослесхоз",9158,3188,"нет аккаунта",7561,1,1,2,0.35899999999999999,2.9000000000000001E-2,0.61699999999999999,0.05,0,0,5.05,8.1000000000000003E-2,3,2,1,0,"0 (Инстаграм)",10,{"$f":"$V17/[1]Коды!$D$28","v":0.58823529411764708}]
["Росмолодёжь",116137,6312,"нет аккаунта",43539,1,2,2,6.9000000000000006E-2,2E-3,0.187,2E-3,0,0,0.55400000000000005,3.0000000000000001E-3,2,1,1,1,"1 (ВК)",10,{"$f":"$V18/[1]Коды!$D$28","v":0.58823529411764708}]
["Росморречфлот","нет аккаунта","нет аккаунта","нет аккаунта",1865,1,0,1,0,0,0,0,0,0,3.5219999999999998,1.4999999999999999E-2,3,1,1,0,"0 (Инстаграм)",7,{"$f":"$V19/[1]Коды!$D$28","v":0.41176470588235292}]
["Роснедра","нет аккаунта","нет аккаунта","нет аккаунта","нет аккаунта",0,0,0,0,0,0,0,0,0,0,0,0,0,0,0,"0 (нельзя написать)",0,{"$f":"$V20/[1]Коды!$D$28","v":0}]
["Рособрнадзор",52986,8480,"нет аккаунта",37072,1,1,1,0.68799999999999994,0,0.5,5.0000000000000001E-3,0,0,0.497,7.0000000000000001E-3,2,1,1,0,"0 (Фейсбук)",7,{"$f":"$V21/[1]Коды!$D$28","v":0.41176470588235292}]
["Роспатент","нет аккаунта",3588,"нет аккаунта","нет аккаунта",1,1,2,0,0,1.0740000000000001,3.5999999999999997E-2,0,0,0,0,3,2,1,0,"0 (Фейсбук)",10,{"$f":"$V22/[1]Коды!$D$28","v":0.58823529411764708}]
["Роспечать","нет аккаунта","нет аккаунта","нет аккаунта","нет аккаунта",0,0,0,0,0,0,0,0,0,0,0,0,0,0,0,"0 (нельзя отправить сообщение)",0,{"$f":"$V23/[1]Коды!$D$28","v":0}]
["Роспотребнадзор",74741,17030,"Страница \"https://ok.ru/group/rospotrebnadzor.official\" не найдена или закрыта",715944,1,0,2,0.65400000000000003,0,0.106,1.2E-2,0,0,5.0000000000000001E-3,0,2,1,0,0,"0 (нельзя отправить сообщение)",6,{"$f":"$V24/[1]Коды!$D$28","v":0.35294117647058826}]
["Росприроднадзор",16021,9886,5990,22705,2,1,2,3.3420000000000001,6.8000000000000005E-2,1.833,6.9000000000000006E-2,1.6539999999999999,6.2E-2,2.645,5.5E-2,3,2,1,0,"0 (Инстаграм)",11,{"$f":"$V25/[1]Коды!$D$28","v":0.6470588235294118}]
["Росреестр",45739,4303,"нет аккаунта","нет аккаунта",1,1,2,0.25700000000000001,0,0.746,0.182,0,0,0,0,2,3,0,0,"0 (нельзя отправить сообщение)",9,{"$f":"$V26/[1]Коды!$D$28","v":0.52941176470588236}]
["Росрезерв",82,127,"нет аккаунта","нет аккаунта",1,1,1,0,0,6.1420000000000003,0.315,0,0,0,0,3,3,1,0,"0 (нет ответа) (Фейсбук)",10,{"$f":"$V27/[1]Коды!$D$28","v":0.58823529411764708}]
["Росрыболовство","нет аккаунта",1302,"нет аккаунта","нет аккаунта",1,1,1,0,0,0.53,0.04,0,0,0,0,1,1,0,0,"0 (нельзя написать сообщение)",5,{"$f":"$V28/[1]Коды!$D$28","v":0.29411764705882354}]
["Россвязь","нет аккаунта",507,"нет аккаунта","нет аккаунта",1,1,2,0,0,0.82099999999999995,4.0000000000000001E-3,0,0,0,0,2,1,1,0,"0 (нет ответа) (Фейсбук)",8,{"$f":"$V29/[1]Коды!$D$28","v":0.47058823529411764}]
["Россельхознадзор","нет аккаунта","нет аккаунта","нет аккаунта","нет аккаунта",1,0,0,0,0,0,0,0,0,0,0,0,0,0,0,"0 (нельзя написать)",1,{"$f":"$V30/[1]Коды!$D$28","v":5.8823529411764705E-2}]
["Россотрудничество",7327,23605,"нет аккаунта",8503,1,1,2,0.126,7.0000000000000001E-3,0.30199999999999999,5.0000000000000001E-3,0,0,0.85099999999999998,8.0000000000000002E-3,2,1,1,0,"0 (Фейсбук)",8,{"$f":"$V31/[1]Коды!$D$28","v":0.47058823529411764}]
["Росстандарт","нет аккаунта",1373,"нет аккаунта","нет аккаунта",1,1,1,0,0,1.357,8.5999999999999993E-2,0,0,0,0,3,2,1,2,"2 (Фейсбук)",11,{"$f":"$V32/[1]Коды!$D$28","v":0.6470588235294118}]
["Росстат",3421,1290,215,"нет аккаунта",1,1,2,0.999,6.5000000000000002E-2,1.7869999999999999,0.05,2.6269999999999998,5.8000000000000003E-2,0,0,3,2,1,2,"2 (ВК)",12,{"$f":"$V33/[1]Коды!$D$28","v":0.70588235294117652}]
["Ростехнадзор",80,887,"нет аккаунта","нет аккаунта",1,1,1,0,0,2.1920000000000002,7.1999999999999995E-2,0,0,0,0,3,2,1,1,"1 (Фейсбук)",10,{"$f":"$V34/[1]Коды!$D$28","v":0.58823529411764708}]
["Ространснадзор","нет аккаунта",137,"нет аккаунта","нет аккаунта",1,1,0,0,0,0,0,0,0,0,0,0,0,1,0,"0 (Фейсбук)",3,{"$f":"$V35/[1]Коды!$D$28","v":0.17647058823529413}]
["Роструд",15884,4184,"нет аккаунта",1811,1,1,2,0.17599999999999999,5.8999999999999997E-2,0.248,3.6999999999999998E-2,0,0,69.174999999999997,0.12,3,3,1,2,"2 (ВК)",13,{"$f":"$V36/[1]Коды!$D$28","v":0.76470588235294112}]
["Ростуризм",8740,1223,"нет аккаунта","нет аккаунта",1,1,2,0.44500000000000001,0.28499999999999998,1.111,0.127,0,0,0,0,3,3,1,0,"0 (ВК)",11,{"$f":"$V37/[1]Коды!$D$28","v":0.6470588235294118}]
["Росфинмониторинг","нет аккаунта","нет аккаунта","нет аккаунта","нет аккаунта",0,0,0,0,0,0,0,0,0,0,0,0,0,0,0,"0 (нельзя отправить сообщение)",0,{"$f":"$V38/[1]Коды!$D$28","v":0}]
["СВР России","нет аккаунта","нет аккаунта","нет аккаунта","нет аккаунта",0,0,0,0,0,0,0,0,0,0,0,0,0,0,0,"0 (нельзя отправить сообщение)",0,{"$f":"$V39/[1]Коды!$D$28","v":0}]
["Управление делами Президента Российской Федерации","нет аккаунта","нет аккаунта","нет аккаунта","нет аккаунта",0,0,0,0,0,0,0,0,0,0,0,0,0,0,0,"0 (нельзя отправить сообщение)",0,{"$f":"$V40/[1]Коды!$D$28","v":0}]
["ФАДН России",3700,2540,23042,5763,2,1,2,0.42799999999999999,6.0000000000000001E-3,0.95599999999999996,1.2E-2,0,0,1.36,1.2E-2,3,2,1,0,"0 (нет ответа) (Фейсбук)",11,{"$f":"$V41/[1]Коды!$D$28","v":0.6470588235294118}]
["ФАС России",21690,8350,705,27028,3,1,2,0.20399999999999999,3.1E-2,0.29799999999999999,3.3000000000000002E-2,0.48,0.06,0.71199999999999997,1.7000000000000001E-2,2,2,2,2,"2 (ВК)",14,{"$f":"$V42/[1]Коды!$D$28","v":0.82352941176470584}]
["Федеральная служба судебных приставов (ФССП России)",68957,2218,"нет аккаунта","нет аккаунта",1,1,2,2.7E-2,0,3.4000000000000002E-2,1.4E-2,0,0,0,0,1,1,0,0,"0 (нельзя отправить сообщение)",6,{"$f":"$V43/[1]Коды!$D$28","v":0.35294117647058826}]
["ФМБА России",0,0,"нет аккаунта",6005,1,0,2,0,0,0,0,0,0,4.056,0.106,3,3,1,0,"0 (Инстаграм)",10,{"$f":"$V44/[1]Коды!$D$28","v":0.58823529411764708}]
["ФНС России",63465,4123,"нет аккаунта","нет аккаунта",1,1,2,0.19600000000000001,0,1.319,5.2999999999999999E-2,0,0,0,0,3,1,0,0,"0 (нельзя отправить сообщение)",8,{"$f":"$V45/[1]Коды!$D$28","v":0.47058823529411764}]
["ФСБ России","нет аккаунта","нет аккаунта","нет аккаунта","нет аккаунта",0,0,0,0,0,0,0,0,0,0,0,0,0,0,0,"0 (нельзя отправить сообщение)",0,{"$f":"$V46/[1]Коды!$D$28","v":0}]
["ФСВТС России","нет аккаунта","нет аккаунта","нет аккаунта","нет аккаунта",0,0,0,0,0,0,0,0,0,0,0,0,0,0,0,"0 (нельзя отправить сообщение)",0,{"$f":"$V47/[1]Коды!$D$28","v":0}]
["ФСИН России",0,276,"нет аккаунта",11678,1,1,2,0,0,0.68500000000000005,8.9999999999999993E-3,0,0,1.952,2.3E-2,3,1,1,1,"1 (Инстаграм)",10,{"$f":"$V48/[1]Коды!$D$28","v":0.58823529411764708}]
["ФСО России","нет аккаунта","нет аккаунта","нет аккаунта","нет аккаунта",0,0,0,0,0,0,0,0,0,0,0,0,0,0,0,"0 (нельзя отпраить сообщение)",0,{"$f":"$V49/[1]Коды!$D$28","v":0}]
["ФСТЭК России","нет аккаунта","нет аккаунта","нет аккаунта","нет аккаунта",0,0,0,0,0,0,0,0,0,0,0,0,0,0,0,"0 (нельзя отправить сообщение) ",0,{"$f":"$V50/[1]Коды!$D$28","v":0}]
["ФТС России","нет аккаунта",2424,"нет аккаунта",19710,1,1,2,0,0,2.25,0.19400000000000001,0,0,5.4809999999999999,6.2E-2,3,3,1,1,"1 (Фейсбук)",12,{"$f":"$V51/[1]Коды!$D$28","v":0.70588235294117652}]
["Федеральная пробирная палата","нет аккаунта","нет аккаунта","нет аккаунта","нет аккаунта",0,0,0,0,0,0,0,0,0,0,0,0,0,0,0,"Ликвидировано",0,{"$f":"$V52/[1]Коды!$D$28","v":0}]